program: Gaussian 09
title: 000186394
version: EM64L-G09RevD.01
frameworkgroup: C1[X(C13H5Cl2F5O)]
method: RPBEPBE
basis: SDD
operation: Freq
keyword: #p
keyword: freq=noraman
keyword: PBEPBE/SDD
title: #p freq=noraman PBEPBE/SDD
converged: YES YES NO NO
title: Mulliken charges:
elementType: Cl Cl F F F F F O C C C C C C C C C C C C C H H H H H
charge: -0.006555 -0.044564 -0.137045 -0.164031 -0.140395 -0.139113 -0.137492 -0.237332 0.218736 -0.436798 0.182297 0.105002 0.510855 0.073311 0.057929 0.124145 -0.297620 -0.317002 -0.191416 -0.228599 -0.113001 0.241494 0.268974 0.263075 0.283440 0.261705
chargesum: 0.00000
title: Mulliken charges with hydrogens summed into heavy atoms:
elementType: Cl Cl F F F F F O C C C C C C C C C C C C C
charge: -0.006555 -0.044564 -0.137045 -0.164031 -0.140395 -0.139113 -0.137492 -0.237332 0.218736 0.073670 0.182297 0.105002 0.510855 0.073311 0.057929 0.124145 -0.297620 -0.053927 0.092024 0.033106 -0.113001
polarizability: 1.85037256e+02 8.75499259e+00 1.87573729e+02 5.77745881e+00 -3.32877491e+00 1.14837668e+02
1716.lowfreq: -4.4980 -3.2588 -0.0018 -0.0014 -0.0011 5.4608 14.3588 19.3968 37.6124
frequency: 14.3348 19.3739 37.5984 72.8530 102.5381 114.2679 127.2647 152.8142 164.7888 171.7861 190.1711 215.5978 254.4097 258.2857 283.2819 289.6420 307.6709 315.3644 336.0052 363.8598 372.2374 386.9582 391.1088 426.6041 438.4435 453.8271 528.5555 541.8048 550.1762 570.6007 614.9311 632.2495 654.8681 678.6638 700.3385 708.0326 746.4990 792.3526 798.3902 863.9009 886.8226 913.3676 925.4542 955.7506 1022.6051 1032.3902 1069.2890 1079.7341 1088.4396 1153.6418 1209.6522 1232.5410 1250.9526 1259.1139 1350.0288 1364.4856 1373.3201 1382.8071 1386.3780 1454.2589 1460.5649 1464.3259 1478.9819 1572.2225 1591.7838 1605.5658 1624.7477 3034.6516 3104.9403 3165.5427 3179.8974 3184.0143
redmass: 16.6509 13.0395 15.3181 10.1245 11.5338 14.7786 17.1343 16.9698 5.9291 14.5362 15.1471 11.1378 16.8912 18.1009 7.2553 7.4059 12.7100 5.8257 7.0497 6.3883 12.6023 9.2348 9.1185 13.5986 3.3220 11.2913 8.2991 6.6351 4.6612 9.3989 6.8513 12.0691 6.7123 7.0571 4.1776 7.6228 11.3787 5.5943 1.5303 1.3907 6.1113 8.1519 1.3720 8.7923 2.7681 3.2624 9.3319 9.3355 2.5496 1.3147 2.6556 5.3245 1.3302 1.4874 1.8497 4.0808 4.3553 5.3751 5.0464 8.4593 2.6727 6.7647 1.1822 7.6036 7.7137 10.7652 11.8712 1.0605 1.1043 1.0882 1.0934 1.0965
irintensity: 0.0110 0.1515 0.2044 0.0396 0.1121 0.3806 0.4543 0.6277 0.2213 1.9880 3.9108 1.0959 0.3253 0.2448 3.0578 0.3324 6.9125 3.5560 2.1876 1.8381 0.0672 1.1398 1.9674 0.1019 10.4544 3.1238 4.8426 4.0054 5.0032 15.2809 31.4956 0.2302 10.4547 23.0480 2.0960 2.7380 6.6122 35.4627 62.4274 19.8505 94.2179 60.9301 0.4648 61.7668 27.1568 107.0953 14.0178 71.7647 31.8039 2.1910 134.0344 28.2023 8.5774 101.3925 25.5516 9.8110 9.8292 26.1282 6.3969 181.4158 274.0522 105.4544 18.1859 25.9471 6.3480 1.6892 29.4419 22.0361 2.0138 1.0317 0.4365 0.4990
temp: 298.150 k
press: 1.00000 atm
elementType: 17 17 9 9 9 9 9 8 6 6 6 6 6 6 6 6 6 6 6 6 6 1 1 1 1 1
symmnumber: 1
zpe: 391781.3 jmol-1
zpe.correction: 0.149222 hartree
zpe.thermalcorrener: 0.168131 hartree
zpe.thermalcorrenthalpy: 0.169075 hartree
zpe.thermalcorrgfe: 0.099309 hartree
zpe.sumelectzpe: -1991.385452 hartree
zpe.sumelectthermal: -1991.366543 hartree
zpe.sumelectthermalent: -1991.365599 hartree
zpe.sumelectthermalfe: -1991.435365 hartree
dipole: 1.1621 -0.7774 2.6420
dipole: 2.9891
quadrupole: -140.9055 -141.5147 -128.0497
quadrupole: 1.9754 6.6724 0.4346
quadrupole: -4.0822 -4.6914 8.7736 1.9754 6.6724 0.4346
hfenergy: -1991.534674 hartree
pointgroup: C01 [X(C13H5Cl2F5O1)]
dipole: 0.3241384 -0.6278393 -0.9400843 debye
dipolederiv: -0.0788367 0.052478 -0.0456274 0.064701 -0.2068758 0.2548273 -0.0677618 0.3065993 -0.5286483 -0.5610601 0.3556077 -0.0381201 0.4172319 -0.3643316 0.0587705 -0.0275163 0.0479839 -0.1207413 -0.1711377 -0.0450597 0.0121832 -0.0449816 -0.3861108 0.34622 -0.0243041 0.3428098 -0.5752032 -0.4467001 -0.090065 -0.2849259 -0.0967228 -0.1602583 -0.063001 -0.2795764 -0.0695232 -0.6615928 -0.1499744 -0.086044 0.0669058 -0.1820912 -0.3925228 0.3993215 0.1508856 0.3764613 -0.6466314 -0.4593215 -0.100415 -0.3620935 -0.1228329 -0.1359952 -0.0721837 -0.4750625 -0.0816236 -0.6145848 -0.5708293 -0.4215891 -0.0071157 -0.5347759 -0.5473241 0.0266751 -0.0350625 0.0050892 -0.1384755 -1.5125465 0.3256818 0.2319714 0.7891226 -0.6795705 -0.1760992 0.1989955 -0.055796 -0.2090816 -0.2786856 -0.0108777 -0.0022648 -0.1247127 -0.19328 0.0363268 0.0232196 -0.0485117 -0.2215808 1.1338079 0.0401853 -0.2052858 0.0893771 0.4149392 0.0656296 -0.4577745 0.1968896 0.3348389 0.2192862 0.1103384 -0.0921804 0.0225067 0.4309868 -0.4567286 0.0872901 -0.3779333 0.6377048 0.4160743 0.1065296 0.3858579 0.1730739 0.1731523 0.1111241 0.232841 0.0375369 0.6880376 1.0906247 -0.4005259 -0.1426999 -0.9466389 0.4189371 0.2846502 0.2067506 0.086569 -0.2042675 0.0216563 0.0194347 -0.1722868 0.0892031 0.3791846 -0.5193866 -0.2429285 -0.4658014 0.6601365 0.4473177 0.024013 0.4852201 0.0707122 0.0030131 0.1938541 0.5646742 0.150829 0.6414728 0.6328233 0.4969514 0.0001808 0.5935562 0.6325748 -0.0135706 0.0418761 0.0113091 0.1156144 -0.1417066 -0.0581642 0.0604288 -0.0294277 0.1984622 -0.4409591 0.1251212 -0.5441804 0.8037606 -0.1936431 -0.0565589 0.0946435 0.1090445 -0.1447851 -0.1547937 -0.2032023 0.0212806 -0.0280366 -0.1754366 0.1076621 -0.0512992 0.1154823 -0.1765945 0.0865237 -0.0272916 0.0999944 -0.1497997 -0.1702397 0.0866859 -0.1013664 0.0387284 -0.1527316 0.0244034 0.0171646 -0.042865 0.0252872 0.7040063 -0.5997769 0.0584471 -0.637526 0.4321612 -0.1138833 0.0200337 -0.0783113 0.0514537 -0.0212409 -0.0249008 -0.0399121 -0.0305432 0.1103015 0.0369654 0.0320468 -0.0822165 -0.0668394 -0.0478633 0.0328581 0.0256708 0.0289794 -0.0018535 0.0009958 0.0204374 0.0798643 0.0941442 0.1107874 0.0647436 0.0690736 0.0637726 0.1068202 0.0091715 0.0817662 0.0101706 0.0359408 0.0910024 0.0318336 0.0527463 0.0386301 0.1379852 0.0056252 0.0502486 0.0056056 0.059546 0.1118357 0.0389741 0.001849 0.046131 0.103716 0.0695216 -0.0128706 0.0677698 0.0175453 unknown
polarizability: 186.217192|-14.2681149|138.1952586|0.5249063|-32.3211586|163.036202 unknown
InChI: InChI=1S/C13H5Cl2F5O/c14-5-1-2-8(7(15)3-5)21-4-6-9(16)11(18)13(20)12(19)10(6)17/h1-3H,4H2
charge 0 multiplicity 1
26 atoms
Cl -2.623177 -1.587012 2.983209
Cl -5.555582 2.05195 -0.01119
F  1.778203 -1.558105 1.758642
F  0.514493 -0.288979 -2.742807
F  2.371787 1.766161 -2.683048
F  3.633717 0.503524 1.81562
F  3.935324 2.175418 -0.399834
O  -1.001024 -1.872349 0.544741
C  1.072074 -0.950584 -0.476203
C  0.041823 -2.068322 -0.480176
C  1.892744 -0.724912 0.652658
C  1.269857 -0.097015 -1.580186
C  -2.015357 -0.92854 0.331719
C  2.214113 0.94742 -1.575058
C  2.844526 0.311527 0.692778
C  3.001505 1.154118 -0.42646
C  -2.891286 -0.702001 1.427603
C  -2.244675 -0.22541 -0.875683
C  -3.967444 0.196658 1.333036
C  -3.321339 0.683506 -0.98624
C  -4.167488 0.882458 0.11796
H  -0.399484 -2.19286 -1.484389
H  0.506895 -3.017785 -0.172075
H  -1.600807 -0.374229 -1.745942
H  -4.62955 0.354519 2.188086
H  -3.490348 1.222443 -1.922361
