program: Gaussian 09
title: 000186393
version: EM64L-G09RevD.01
frameworkgroup: C1[X(C13H6ClF5O)]
method: RPBEPBE
basis: SDD
operation: Freq
keyword: #p
keyword: freq=noraman
keyword: PBEPBE/SDD
title: #p freq=noraman PBEPBE/SDD
converged: NO YES NO YES
title: Mulliken charges:
elementType: Cl F F F F F O C C C C C C C C C C C C C H H H H H H
charge: -0.058514 -0.148671 -0.148696 -0.141944 -0.141942 -0.139385 -0.265618 0.232756 -0.392712 0.131024 0.130698 0.061478 0.061470 0.369333 0.126032 -0.317817 -0.351628 -0.206585 -0.185060 -0.117620 0.238591 0.238539 0.253302 0.259091 0.254808 0.259074
chargesum: 0.00000
title: Mulliken charges with hydrogens summed into heavy atoms:
elementType: Cl F F F F F O C C C C C C C C C C C C C
charge: -0.058514 -0.148671 -0.148696 -0.141944 -0.141942 -0.139385 -0.265618 0.232756 0.084418 0.131024 0.130698 0.061478 0.061470 0.369333 0.126032 -0.064516 -0.092538 0.048223 0.074014 -0.117620
polarizability: 2.47415605e+02 1.26813731e-02 1.14535248e+02 9.77760808e+00 -5.24941077e-02 1.10522638e+02
1716.lowfreq: -5.9380 -2.3387 -0.0021 -0.0020 -0.0015 4.3638 11.1027 25.4731 34.3753
frequency: 10.7103 25.4487 34.3750 70.3274 109.7867 120.8575 128.2009 138.5407 162.4091 212.2390 253.5193 257.0033 259.0574 282.0663 286.9986 312.6223 319.3892 340.7729 372.4859 397.4940 413.9586 426.5397 441.7944 463.8067 497.2629 538.3658 591.1597 605.0867 623.8341 632.6185 681.2487 695.4142 700.9368 741.0827 799.3416 812.0059 823.4025 884.7478 926.7758 930.3887 953.6172 953.9905 991.8170 1030.8557 1072.7934 1073.4255 1089.9676 1110.8784 1175.2959 1209.2077 1221.8019 1239.1459 1292.1349 1363.7702 1372.8678 1381.8054 1394.1005 1404.4353 1459.0847 1468.1684 1469.8464 1479.7434 1585.8638 1603.8564 1609.5461 1628.2385 2991.2143 3052.5750 3155.7349 3161.8545 3175.6695 3181.7738
redmass: 9.4005 5.8052 12.5865 6.9008 10.5111 18.0002 14.2704 8.6457 17.2474 13.3005 13.0410 11.9406 10.1895 3.1635 9.4729 14.7659 6.8364 9.8359 12.6046 11.4187 2.9980 14.3022 6.3928 10.2092 2.7027 14.6512 8.1990 8.8216 7.2904 12.1597 9.1399 3.5676 5.7223 10.2714 1.3142 7.9497 1.5269 5.2211 1.3575 8.8634 1.3463 8.8951 3.9825 2.1649 2.6150 7.8159 7.8070 1.3116 1.2365 3.4588 1.1315 8.4539 1.2662 2.3040 8.7073 2.0079 11.4400 3.6918 9.4076 4.9079 1.9849 1.4211 7.3448 6.7420 10.6156 11.9255 1.0558 1.1081 1.0879 1.0885 1.0966 1.0978
irintensity: 0.2454 0.0044 0.2547 0.2941 0.8330 0.0801 0.1083 2.5432 0.1124 2.5876 0.7226 0.3742 0.1598 7.0438 0.0049 6.8270 0.6606 0.2756 0.0043 6.0479 0.0419 0.0001 0.8239 0.0702 23.1816 1.0685 0.0469 22.1183 5.5319 0.0010 58.6159 0.1421 0.0540 7.6896 13.1008 23.0133 65.4008 113.1034 1.5359 78.5536 0.0133 60.4751 40.2918 48.7361 35.5297 0.0711 57.8212 13.1790 86.8227 278.8001 13.4509 41.2631 4.1732 9.2560 7.2177 42.2895 76.4694 2.6558 244.3702 5.8007 236.0403 62.1989 18.0324 19.5140 0.4838 31.0232 25.8414 7.2984 12.6738 1.7179 6.1214 1.0509
temp: 298.150 k
press: 1.00000 atm
elementType: 17 9 9 9 9 9 8 6 6 6 6 6 6 6 6 6 6 6 6 6 1 1 1 1 1 1
symmnumber: 1
zpe: 416773.9 jmol-1
zpe.correction: 0.158741 hartree
zpe.thermalcorrener: 0.176474 hartree
zpe.thermalcorrenthalpy: 0.177418 hartree
zpe.thermalcorrgfe: 0.109952 hartree
zpe.sumelectzpe: -1532.002559 hartree
zpe.sumelectthermal: -1531.984826 hartree
zpe.sumelectthermalent: -1531.983881 hartree
zpe.sumelectthermalfe: -1532.051347 hartree
dipole: 0.2287 0.0033 -1.8404
dipole: 1.8546
quadrupole: -143.3039 -130.7259 -107.2921
quadrupole: -0.0018 -2.4545 -0.0268
quadrupole: -16.1966 -3.6186 19.8152 -0.0018 -2.4545 -0.0268
hfenergy: -1532.1612998 hartree
pointgroup: C01 [X(C13H6Cl1F5O1)]
dipole: 0.0972612 -0.0008975 -0.7231386 debye
dipolederiv: -0.907794 0.0013422 0.0004794 0.0012956 -0.0670436 -0.0000673 -0.0127242 -0.0000486 -0.1256267 -0.3444793 -0.2974217 -0.0723191 -0.2342893 -0.7505585 -0.1007609 -0.0761988 -0.1003842 -0.1224118 -0.3418311 0.2951545 -0.0730877 0.2318705 -0.75238 0.1038014 -0.0767465 0.1034657 -0.1233153 -0.4065742 -0.3352645 -0.0753559 -0.4321674 -0.7365948 -0.0972429 -0.1028457 -0.1002375 -0.1018431 -0.4028993 0.3332185 -0.076336 0.4301237 -0.739257 0.1003724 -0.1042373 0.1035025 -0.1027163 -1.0092502 0.0014251 -0.2445304 0.0014052 -0.1547612 0.0005828 -0.2943333 0.000676 -0.1562583 -2.1899719 0.0035863 0.1785132 0.0035988 -0.2432983 -0.0004169 0.2397986 -0.0005356 -0.3049716 -0.2107208 -0.000007 -0.0040536 -0.0001621 -0.2002353 0.0002765 -0.1122868 0.0004841 -0.1089703 1.1598976 -0.0018154 -0.0920474 -0.0026758 0.2776406 0.000462 -0.5562778 0.0013123 0.4726298 0.433668 0.4217086 0.0893305 0.1479334 0.8224103 0.1010222 0.0777091 0.1329348 0.1143409 0.4307234 -0.4194014 0.0906419 -0.1454069 0.8243779 -0.1044587 0.0779854 -0.1363619 0.1153998 0.2461822 0.5110606 0.0365042 0.5615303 0.7418081 0.1335953 0.0632063 0.1610896 0.0772646 0.2411116 -0.5084114 0.0380772 -0.5588288 0.7455308 -0.1366806 0.0649393 -0.1643472 0.078551 1.8567189 -0.003078 -0.1055123 -0.0024978 0.1049521 0.0000752 0.1998917 -0.0005021 0.0114593 1.1248219 -0.0016572 0.2872866 -0.0016926 0.1405585 -0.0006043 0.3242579 -0.0006623 0.1782629 -0.3313927 0.0003272 0.0604608 -0.000077 -0.1957122 0.0000756 -0.2731917 0.0006549 -0.0126182 -0.3752927 0.0003927 0.0015044 0.0005691 -0.1626476 0.0002023 0.1855037 -0.0000575 0.0351746 -0.1712611 0.000051 -0.0579545 0.0001767 -0.0917348 0.0002842 0.0604307 0.0000875 0.0702442 -0.1381185 0.0000883 0.0187233 0.0000474 -0.0953973 0.0001642 0.0048866 0.0001735 0.0778616 1.2040084 -0.0020055 0.0268496 -0.0020227 -0.0924177 0.000021 -0.0114636 0.0000775 -0.0337398 -0.0146217 0.0297462 -0.0284877 0.0191997 -0.0163968 0.0958857 0.1354341 0.0458584 -0.0135796 -0.0150095 -0.0298612 -0.028914 -0.0187674 -0.0166046 -0.0958165 0.1353708 -0.0463417 -0.0132301 0.0201004 0.0003253 0.0923795 0.0003551 0.164913 -0.0003349 0.1240182 -0.0004063 -0.0156073 0.0531834 0.0000996 -0.0711146 0.0001113 0.166795 -0.000056 -0.0707981 -0.0000703 0.0053777 0.0463355 0.0001165 -0.0620133 0.0001126 0.1625695 -0.0000898 -0.0655705 -0.0000795 -0.0037749 0.0424657 0.0002806 0.0709759 0.0002584 0.1634837 -0.000292 0.0632417 -0.000282 0.0020968 unknown
polarizability: 247.2049109|-0.1896142|114.5351807|11.1516875|-0.0826895|110.733399 unknown
InChI: InChI=1S/C13H6ClF5O/c14-6-1-3-7(4-2-6)20-5-8-9(15)11(17)13(19)12(18)10(8)16/h1-4H,5H2
charge 0 multiplicity 1
26 atoms
Cl -7.041653 0.014847 0.086279
F  1.288033 -2.419882 -0.49157
F  1.2997 2.419951 -0.502089
F  3.947101 2.416297 0.344449
F  3.935443 -2.425325 0.355028
F  5.269085 -0.00676 0.778935
O  -1.013713 0.005562 0.316645
C  1.233586 0.000139 -0.50752
C  -0.21487 0.002588 -0.926737
C  1.934188 -1.203329 -0.282152
C  1.939956 1.201195 -0.287377
C  3.281369 1.216448 0.139535
C  3.275505 -1.22319 0.14485
C  -2.415538 0.007637 0.169244
C  3.949281 -0.00451 0.358162
C  -3.094162 0.007344 -1.073821
C  -3.144664 0.010163 1.384114
C  -4.508816 0.009566 -1.095753
C  -4.552117 0.012387 1.361131
C  -5.218291 0.012042 0.117113
H  -0.444753 0.906972 -1.521169
H  -0.448328 -0.902243 -1.519113
H  -2.554237 0.00547 -2.024872
H  -2.597481 0.010348 2.331075
H  -5.043418 0.009341 -2.0499
H  -5.120902 0.014342 2.295116
