program: Gaussian 09
title: 000186383
version: EM64L-G09RevD.01
frameworkgroup: C1[X(C8H8BrN3O3)]
method: RPBEPBE
basis: SDD
operation: Freq
keyword: #p
keyword: freq=noraman
keyword: PBEPBE/SDD
title: #p freq=noraman PBEPBE/SDD
converged: YES YES NO NO
title: Mulliken charges:
elementType: Br O O O N N N C C C C C C C C H H H H H H H H
charge: 0.057008 -0.168955 -0.215448 -0.268251 -0.446265 -0.394118 -0.041223 0.340228 0.184498 -0.383767 0.229303 -0.003647 -0.801323 0.256421 -0.776734 0.423322 0.260274 0.364196 0.304009 0.304385 0.275825 0.249686 0.250575
chargesum: 0.00000
title: Mulliken charges with hydrogens summed into heavy atoms:
elementType: Br O O O N N N C C C C C C C C
charge: 0.057008 -0.168955 -0.215448 -0.268251 -0.022943 -0.029922 -0.041223 0.340228 0.184498 -0.123493 0.229303 -0.003647 -0.192929 0.256421 -0.000648
polarizability: 1.77067069e+02 -4.31488304e+00 1.73727668e+02 -7.17883129e-02 1.10325085e-01 5.93281765e+01
1716.lowfreq: -46.2787 -6.6649 -5.6331 -0.8002 -0.0005 -0.0004 0.0004 28.6108 53.7747
frequency: -46.2616 28.5775 53.7688 63.8676 77.0283 84.5454 126.4464 143.4250 165.1784 170.1174 239.4752 249.8542 303.2316 347.6503 405.8666 435.4507 499.8948 538.2208 563.7781 571.3220 634.7141 639.0390 664.3592 690.6321 719.6077 738.5596 756.7632 849.9623 860.2611 893.5686 901.6132 942.5983 954.3921 985.9466 1022.0404 1040.6289 1061.3413 1127.2944 1128.1993 1204.2185 1221.6456 1241.4944 1256.3190 1380.9327 1385.1881 1409.7256 1422.2686 1452.7625 1463.6564 1492.4310 1544.3904 1597.9706 1613.6822 1616.6367 1623.9881 2995.8799 3036.2872 3080.8813 3109.8659 3142.6717 3185.4427 3243.0660 3524.3679
redmass: 1.0325 7.4393 2.9051 8.6752 9.2796 4.9853 4.8918 7.4954 7.6611 13.9264 5.7331 5.8174 8.9446 5.1219 10.9791 4.1412 7.3997 4.6623 8.6935 3.1001 3.4201 6.3514 2.6754 6.2728 1.8642 6.3936 2.5715 6.6848 1.7712 4.7305 1.7554 1.0981 6.1901 1.7637 3.2183 1.6752 3.4786 1.1585 3.0004 1.9561 2.1611 1.5706 1.7856 4.0471 1.2425 1.0979 2.7149 1.3862 1.0454 2.7992 4.8034 6.6820 8.1140 8.2047 5.4082 1.0385 1.0570 1.0979 1.1061 1.0986 1.0935 1.0821 1.0776
irintensity: 0.3436 0.0221 14.3967 1.6274 7.7956 0.1859 1.3421 14.9860 3.0444 1.1076 2.0520 17.7566 1.5391 16.0476 0.6515 0.7737 5.2469 12.5180 8.7713 0.5736 0.0057 32.5790 17.4514 9.5316 39.7705 4.1587 63.7041 19.4541 36.6212 2.2609 0.0266 101.2401 18.1769 29.4441 2.7733 11.2923 13.2871 7.9689 207.9515 60.5949 47.5970 100.9200 20.4626 54.4574 34.6323 23.1473 308.0812 152.6704 22.1991 163.7310 724.2520 204.5082 46.0046 317.2380 27.6497 2.2712 23.0509 7.4573 0.0269 3.2736 2.7596 292.8489 54.3912
temp: 298.150 k
press: 1.00000 atm
elementType: 35 8 8 8 7 7 7 6 6 6 6 6 6 6 6 1 1 1 1 1 1 1 1
symmnumber: 1
zpe: 418244.3 jmol-1
zpe.correction: 0.159301 hartree
zpe.thermalcorrener: 0.173333 hartree
zpe.thermalcorrenthalpy: 0.174277 hartree
zpe.thermalcorrgfe: 0.115332 hartree
zpe.sumelectzpe: -711.961161 hartree
zpe.sumelectthermal: -711.947129 hartree
zpe.sumelectthermalent: -711.946185 hartree
zpe.sumelectthermalfe: -712.005130 hartree
dipole: -3.0015 -2.1600 0.0179
dipole: 3.6980
quadrupole: -72.5423 -126.4834 -94.4968
quadrupole: 24.4395 0.0222 0.0093
quadrupole: 25.2985 -28.6426 3.3440 24.4395 0.0222 0.0093
hfenergy: -712.1204621 hartree
pointgroup: C01 [X(C8H8Br1N3O3)]
dipole: 1.2775878 -0.5330378 -0.4476129 debye
dipolederiv: -0.2845399 -0.0354249 -0.1168196 -0.0797477 -0.0684989 -0.0180961 -0.1818312 -0.0047638 -0.1332406 -0.6018378 0.0686705 0.003367 0.0230442 -0.4261124 -0.233905 -0.0677364 -0.2204278 -0.6234046 -0.5064381 0.0383344 0.0172531 0.0931036 -0.6499013 -0.4052856 0.1004359 -0.4200338 -0.9802139 -0.7446396 -0.0650658 -0.226107 0.163124 -0.5075389 -0.2359234 0.1280438 -0.3047076 -0.7518545 -1.1628078 0.2635042 0.1085403 0.0566869 -0.3928771 -0.3112548 -0.2061482 -0.2475293 -0.6167963 -1.1938684 0.5244587 0.5531161 0.5835201 -0.7609225 -0.4485018 0.6451494 -0.4681563 -0.882146 -0.8468423 0.4000918 0.4479734 0.3457373 -0.6578182 -0.4482977 0.3643915 -0.4318854 -0.8494016 0.1970924 -0.3413917 -0.4788378 -0.2740073 0.1297997 0.0228096 -0.376124 0.0022634 -0.0495806 1.5927107 -0.509762 -0.3786792 -0.3488829 0.6538598 0.5276907 -0.1333008 0.4796548 0.9314761 -0.2723718 -0.1460416 -0.2670122 0.070026 -0.1677487 -0.0534095 0.0591963 -0.1178189 -0.2819753 1.2596859 0.0413285 0.4015157 -0.2003785 0.3781185 0.294841 0.0393542 0.3680577 0.7177968 0.9550403 -0.2204035 -0.118108 -0.2401929 0.7039788 0.6716544 -0.1453062 0.676182 1.2107921 0.0026631 0.1698742 0.2347964 0.3698332 0.0458086 0.0821702 0.5316607 0.0214035 0.2560273 1.1650268 -0.1864967 0.0001583 -0.5046343 0.7323959 0.6775302 -0.4925966 0.773721 1.2372232 -0.4957326 0.1609917 0.0921639 0.0890897 -0.0118235 -0.0446624 -0.010658 -0.0259328 -0.0066738 0.5219166 -0.0954775 -0.0860723 -0.1353418 0.3774338 0.0510003 -0.1478465 0.0625683 0.3700702 -0.0487044 0.0354249 -0.0060052 0.0608844 0.1356607 -0.0046853 0.0328436 -0.0125548 0.1413534 0.2259421 0.0284083 0.0133458 0.0057984 0.2849112 -0.0658834 -0.0214097 -0.058805 0.2324753 0.0211914 -0.0203061 -0.1034994 -0.0116664 0.1026051 0.003509 -0.0734365 0.0131663 -0.0814218 0.0002233 -0.0887033 -0.083843 -0.0679608 -0.016656 -0.0473086 -0.0679607 -0.0654533 0.0583835 0.0928511 -0.0027981 -0.0174294 0.0351338 0.0769179 -0.0811721 0.0374071 -0.0915663 0.0115929 0.0783994 0.0247184 -0.0049577 0.0495627 0.0812952 0.0589094 -0.0337532 0.0878353 -0.0349224 0.0450394 -0.0439343 0.0151408 -0.0827317 -0.0428877 0.0082712 0.0196253 -0.0152173 0.1244406 unknown
polarizability: 172.7359005|-12.9351772|95.5040949|13.9192178|51.3786941|141.8829183 unknown
InChI: InChI=1S/C8H8BrN3O3/c1-4(13)10-8-11-5(6(14)3-9)2-7(15)12-8/h2,10-11H,3H2,1H3
charge 0 multiplicity 1
23 atoms
Br -4.97007 -0.632869 -1.691337
O  -1.914011 -1.268481 -1.748752
O  -0.093822 1.62688 3.217009
O  1.929468 -1.985212 -1.707203
N  0.190754 -0.653271 -0.174922
N  2.539378 -0.842615 0.231306
N  1.244933 0.38915 1.724949
C  -1.064923 -0.163843 0.190548
C  1.278266 -0.342921 0.619829
C  -1.18745 0.607264 1.328435
C  -2.176831 -0.557341 -0.74646
C  -0.004943 0.924338 2.170011
C  -3.573421 -0.045921 -0.394928
C  2.83354 -1.627982 -0.891351
C  4.294411 -2.007502 -1.04283
H  0.329823 -1.238833 -1.024666
H  -2.148908 1.011343 1.653935
H  3.283512 -0.564335 0.878229
H  -3.887939 -0.417843 0.594273
H  -3.593943 1.056519 -0.389162
H  4.407682 -2.629237 -1.941806
H  4.651214 -2.576681 -0.1651
H  4.929583 -1.108806 -1.146406
