program: Gaussian 09
title: 000186378
version: EM64L-G09RevD.01
frameworkgroup: C1[X(C5H12N2O2)]
method: RPBEPBE
basis: SDD
operation: Freq
keyword: #p
keyword: freq=noraman
keyword: PBEPBE/SDD
title: #p freq=noraman PBEPBE/SDD
converged: NO YES NO NO
title: Mulliken charges:
elementType: O O N N C C C C C H H H H H H H H H H H H
charge: -0.424659 -0.270323 -0.090958 0.042831 -0.050170 -0.345111 -0.715698 -0.697789 -0.325796 0.254188 0.242626 0.198544 0.225627 0.209620 0.256385 0.212988 0.218198 0.227896 0.232856 0.244845 0.353899
chargesum: 0.00000
title: Mulliken charges with hydrogens summed into heavy atoms:
elementType: O O N N C C C C C
charge: -0.070760 -0.270323 -0.090958 0.042831 0.204018 0.096058 -0.024065 -0.038707 0.151905
polarizability: 7.85767002e+01 -1.81268199e-02 8.63453340e+01 2.32036266e+00 -2.00256952e+00 6.53181025e+01
1716.lowfreq: -4.4177 -0.0009 -0.0007 -0.0003 10.2527 19.8724 49.2150 74.0547 103.6757
frequency: 48.9045 73.9828 103.6613 141.7300 204.3762 212.6156 225.1083 250.0830 294.8495 327.6046 359.1637 393.2986 416.9455 491.5489 608.5425 699.1761 705.5394 782.0315 836.0672 903.1723 953.5298 970.3445 995.4721 1003.2019 1047.0925 1091.7610 1128.3354 1163.8254 1210.2188 1259.3690 1277.8262 1290.3946 1336.4980 1341.8769 1348.9646 1374.3932 1391.2220 1395.2748 1404.3868 1448.6570 1465.0241 1474.9560 1481.5185 1485.6241 1493.0731 2979.9223 2981.4008 2994.5318 2996.1818 3026.3456 3049.0091 3077.2983 3079.0079 3085.5864 3105.6528 3137.0268 3561.5376
redmass: 3.7439 2.5167 3.4113 2.8038 1.3060 1.5983 3.0431 1.9744 2.0921 3.0221 2.8522 2.3913 1.6416 4.0058 3.3360 5.0514 3.5318 1.2636 2.3982 2.5755 4.5332 1.7896 1.4867 1.6080 1.8519 1.7001 2.0883 1.9253 2.9730 1.4420 1.4620 1.6848 1.5608 1.6130 1.6257 1.5433 1.2342 1.2231 1.1929 1.0725 1.0601 1.0625 1.0471 1.0543 1.0496 1.0435 1.0698 1.0499 1.0542 1.0651 1.0989 1.0991 1.1003 1.0989 1.1000 1.1002 1.0662
irintensity: 0.6388 0.4571 9.0589 0.5243 0.5294 2.7873 3.8004 0.1657 19.8559 7.4638 28.2222 50.2123 69.5698 17.0356 1.7641 15.8714 37.4214 8.4247 3.7823 199.1801 61.8459 17.1263 0.5331 25.1965 54.9403 20.9926 1.9518 8.1470 53.7798 68.0611 19.2842 20.8259 38.2998 38.4056 21.4108 6.7168 21.7058 11.7376 14.4646 11.9028 7.0427 19.4685 8.0348 18.1349 6.4295 25.1167 6.1206 18.8711 29.6079 30.8415 0.2323 40.8723 56.7848 32.4346 14.2904 10.7619 10.9133
temp: 298.150 k
press: 1.00000 atm
elementType: 8 8 7 7 6 6 6 6 6 1 1 1 1 1 1 1 1 1 1 1 1
symmnumber: 1
zpe: 460471.0 jmol-1
zpe.correction: 0.175384 hartree
zpe.thermalcorrener: 0.186320 hartree
zpe.thermalcorrenthalpy: 0.187264 hartree
zpe.thermalcorrgfe: 0.138936 hartree
zpe.sumelectzpe: -456.857134 hartree
zpe.sumelectthermal: -456.846198 hartree
zpe.sumelectthermalent: -456.845254 hartree
zpe.sumelectthermalfe: -456.893583 hartree
dipole: -0.8664 -2.4817 0.4047
dipole: 2.6596
quadrupole: -51.5245 -68.0007 -52.8725
quadrupole: 2.8998 0.3966 0.8341
quadrupole: 5.9414 -10.5348 4.5933 2.8998 0.3966 0.8341
hfenergy: -457.0325184 hartree
pointgroup: C01 [X(C5H12N2O2)]
dipole: 0.4863066 -0.5975202 -0.70806 debye
dipolederiv: -0.7302961 -0.3353143 -0.3209317 -0.3455657 -0.5333966 -0.0043277 -0.166992 0.1545066 -0.4970587 -0.2409133 -0.2339785 -0.3278634 0.0909389 -0.4053805 -0.1605395 0.109144 -0.5924814 -0.8705967 -0.4655738 0.0951751 0.1677764 -0.1058634 -0.6790112 -0.4230507 -0.1506761 -0.4163731 -0.7336719 -0.0662247 -0.0574896 -0.0332719 -0.1780036 0.5562317 0.6744452 -0.2465716 0.8661031 0.8539522 0.3928757 -0.0220255 0.0212654 -0.0819503 0.3075224 -0.045348 0.0399041 -0.1112902 0.0738386 0.098206 -0.0124417 -0.0089235 0.034505 -0.0166718 -0.0665506 -0.003778 -0.0076551 0.0821646 -0.0694922 -0.0074004 0.0150939 0.0032426 -0.1021574 -0.035842 -0.042858 -0.0006482 0.1091779 -0.0023565 -0.0507002 0.0454197 -0.0627058 0.0678496 0.0543864 0.024636 0.0506253 -0.0384392 0.8195067 0.4477861 0.3261525 0.430204 0.5720294 0.07965 0.2495636 0.1207767 0.7154197 0.0026515 -0.0005486 0.055752 0.0098969 0.0391376 -0.026682 0.0046291 0.0594238 -0.0785384 0.1045793 0.0076884 0.0426884 -0.0354836 -0.0739993 -0.0671882 0.0102379 -0.0716492 -0.0016816 -0.1010985 0.0977466 -0.0606078 0.0958705 0.0220051 0.1012315 -0.0469123 0.0771785 -0.0031308 -0.0350825 0.1275803 -0.0822465 0.090168 0.0196957 0.0146937 -0.090961 0.0595304 0.02751 0.097049 0.009206 0.0537865 0.0000373 0.08006 0.0393455 0.0633554 -0.0247838 -0.14048 -0.0206826 -0.1263806 0.0291576 -0.0930796 0.0439578 0.0061137 0.0429487 -0.0108981 0.0958638 0.1060409 0.0223046 -0.0029377 0.0518186 -0.0959221 -0.1349875 0.0175679 -0.0914678 -0.0074021 -0.0362828 0.1152673 -0.1144687 0.1038293 0.0210786 0.0443221 -0.0680801 0.0502128 0.0124763 -0.1072236 -0.1244201 0.0475321 -0.1352878 0.0172785 0.0316486 0.0232246 0.008479 0.0762932 -0.0159779 -0.0251645 0.0808431 0.0029051 0.0564997 -0.0876529 0.0749504 -0.0438776 0.0075317 -0.0023565 0.0145131 -0.0720322 0.0212849 -0.1050038 0.0994387 -0.0171161 0.0156114 0.0693369 0.2726519 0.0585965 0.1378158 0.1032385 0.2081965 -0.0931066 0.1737836 -0.0913232 0.2474343 unknown
polarizability: 78.8656367|-1.8812413|75.5087584|0.5249891|10.7344554|75.8657415 unknown
InChI: InChI=1S/C5H12N2O2/c1-3-5(2)7(4-8)6-9/h5,8H,3-4H2,1-2H3
charge 0 multiplicity 1
21 atoms
O  -2.282712 -1.368514 -0.886049
O  -0.602633 1.357487 1.998138
N  -0.580969 0.048556 0.159341
N  -1.173725 1.084935 0.878585
C  0.605899 -0.69686 0.685889
C  1.908426 0.133145 0.477333
C  0.687493 -2.124903 0.113059
C  2.258881 0.441754 -0.993595
C  -1.321021 -0.281918 -1.063754
H  0.434984 -0.751753 1.780815
H  1.810538 1.077167 1.04388
H  2.733793 -0.437276 0.947547
H  1.460157 -2.683596 0.670494
H  0.973156 -2.138368 -0.953368
H  -0.27431 -2.654528 0.213247
H  2.42802 -0.476673 -1.585361
H  1.458305 1.027001 -1.482818
H  3.184432 1.042317 -1.048065
H  -0.629572 -0.649661 -1.833253
H  -1.816285 0.650116 -1.392868
H  -3.01746 -1.054827 -0.299396
