program: Gaussian 09
title: 000186419
version: EM64L-G09RevD.01
frameworkgroup: C1[X(C17H18N2O5S)]
method: RPBEPBE
basis: SDD
operation: Freq
keyword: #p
keyword: freq=noraman
keyword: PBEPBE/SDD
title: #p freq=noraman PBEPBE/SDD
converged: YES YES NO NO
title: Mulliken charges:
elementType: S O O O O O N N C C C C C C C C C C C C C C C C C H H H H H H H H H H H H H H H H H H
charge: 0.916925 -0.315310 -0.505967 -0.537809 -0.195953 -0.197768 -0.345623 0.026415 0.013731 -0.389568 -0.360454 -0.249782 0.509335 -0.729053 -0.024914 -0.446454 -0.400275 -0.200089 -0.232412 -0.222807 -0.241005 -0.354748 -0.344439 -0.236793 0.393629 0.237817 0.299340 0.240219 0.233422 0.229522 0.234761 0.237717 0.225782 0.264979 0.228350 0.301084 0.343673 0.303098 0.229219 0.232295 0.300260 0.297469 0.232179
chargesum: 0.00000
title: Mulliken charges with hydrogens summed into heavy atoms:
elementType: S O O O O O N N C C C C C C C C C C C C C C C C C
charge: 0.916925 -0.315310 -0.505967 -0.537809 -0.195953 -0.197768 -0.345623 0.026415 0.251548 0.149991 0.102490 -0.015020 0.509335 -0.000574 -0.024914 -0.218103 -0.099191 0.143584 0.070686 0.006412 -0.008710 -0.054487 -0.046970 -0.004614 0.393629
polarizability: 3.45670154e+02 1.49537580e+00 2.26973382e+02 1.70626626e+01 -1.33745622e+01 1.67074352e+02
1716.lowfreq: -8.9538 -4.7287 0.0005 0.0011 0.0013 9.4144 22.3515 34.7638 39.2559
frequency: 22.1917 34.6443 39.2092 46.1503 54.4820 65.2558 73.2110 80.1860 96.0143 107.5925 122.2663 135.5372 166.9759 189.6565 194.5147 215.3663 229.3981 235.5527 256.2955 262.5746 276.7796 311.4316 318.5653 348.6032 350.9831 383.0502 406.7120 409.7722 411.3128 442.2138 477.0260 492.3015 505.5164 512.9077 550.9352 586.9528 611.7250 615.0478 636.4320 664.4920 681.1355 696.0344 714.0272 731.4068 733.2004 776.2533 777.8015 780.2881 796.3510 812.6670 864.8936 866.9438 885.1697 889.6411 915.1019 937.4716 973.4324 987.8354 988.9105 990.7952 994.8451 999.6777 1000.1145 1015.2998 1015.6747 1029.1007 1041.9023 1044.5567 1061.0562 1081.2312 1085.4137 1095.6576 1105.7885 1110.6322 1125.8560 1132.6139 1174.4514 1180.1180 1200.4804 1209.5233 1217.8298 1237.9373 1268.8397 1284.9013 1293.8158 1311.3390 1344.4134 1347.4814 1369.5465 1383.9335 1390.9006 1392.5918 1396.0279 1420.3308 1443.1428 1449.5369 1456.9619 1459.1601 1469.5946 1483.1492 1489.2728 1578.7480 1591.2942 1602.9474 1611.5227 2935.4752 2949.1053 2995.7687 3008.5457 3071.5675 3088.9270 3091.3650 3102.6568 3106.7825 3109.7720 3122.9222 3133.6916 3146.4637 3162.7052 3164.1018 3182.9092 3186.5299 3189.1841
redmass: 7.7402 6.3875 6.2369 4.3751 6.1410 4.7080 5.7745 5.2302 6.8941 4.2134 6.1272 6.1362 7.8859 4.4558 8.0430 3.1765 8.0917 5.2813 1.8774 2.2137 5.1189 4.6272 4.2445 6.8638 3.1559 9.1368 3.1023 3.3543 3.2050 3.8026 4.2403 5.2588 6.7383 6.9241 3.1676 4.1639 7.0765 6.1891 4.0777 5.3157 8.8534 5.0001 1.8110 3.0659 4.2882 4.0128 2.1488 7.8492 13.1506 2.9065 1.2598 1.2513 1.6697 2.3750 11.0234 1.3922 1.8763 3.4804 1.4085 4.7101 1.7570 1.5158 1.5082 1.3595 1.3187 2.0594 1.4974 2.3451 2.4129 1.7143 3.9375 1.9736 1.4615 1.3178 1.4260 2.3157 1.0591 1.3017 1.1642 2.0590 7.0998 1.4614 1.1642 1.6406 1.2766 1.2199 1.8438 1.2416 6.7105 5.3227 1.5067 4.0690 1.2455 6.3976 2.0451 1.0893 1.9356 1.3401 1.0626 1.7218 1.1780 5.9378 5.8645 8.1806 5.7859 1.0824 1.0604 1.0363 1.0988 1.0523 1.0904 1.0992 1.0967 1.0886 1.0996 1.0887 1.0902 1.0952 1.0905 1.1012 1.1193 1.0936 1.0957
irintensity: 0.2003 0.2450 0.3446 0.2878 0.3810 0.2842 2.3568 0.8331 3.7659 1.9599 8.1724 2.5234 3.8311 0.4353 8.2981 1.3613 3.0466 0.6591 5.7740 6.9193 5.1571 3.8450 1.5039 10.0871 24.5606 23.2087 8.5716 10.6653 4.0567 14.5404 1.4718 18.5750 8.1753 108.3344 13.1915 18.2864 2.7401 2.8011 26.1180 27.8549 34.5137 18.9715 52.2432 6.9375 8.0285 4.2637 36.2993 62.5402 32.2126 59.1902 6.1156 0.6427 71.3035 2.2976 73.6264 3.4440 10.5184 1.7839 0.8604 4.6650 15.0767 1.3903 6.0313 2.2558 2.5119 9.0702 3.3101 21.1967 14.2256 8.9822 8.4800 20.3228 11.8743 11.3397 6.3914 19.0552 0.1930 19.9131 0.4012 30.2302 299.1400 4.7841 6.9140 41.0336 0.5334 22.3586 9.8502 3.6567 61.0791 2.8244 4.5676 41.6172 24.1109 48.9459 17.0948 19.7125 9.5689 7.9882 13.9137 9.3948 24.0292 33.0215 1.9360 0.5088 2.6017 12.0355 28.1476 19.4673 5.5341 21.0240 34.2650 36.6129 68.5294 9.3005 7.2598 12.5124 4.8431 22.1521 7.3361 41.2741 28.9196 4.1188 1.0536
temp: 298.150 k
press: 1.00000 atm
elementType: 16 8 8 8 8 8 7 7 6 6 6 6 6 6 6 6 6 6 6 6 6 6 6 6 6 1 1 1 1 1 1 1 1 1 1 1 1 1 1 1 1 1 1
symmnumber: 1
zpe: 846279.5 jmol-1
zpe.correction: 0.322331 hartree
zpe.thermalcorrener: 0.346401 hartree
zpe.thermalcorrenthalpy: 0.347345 hartree
zpe.thermalcorrgfe: 0.266989 hartree
zpe.sumelectzpe: -1540.144032 hartree
zpe.sumelectthermal: -1540.119961 hartree
zpe.sumelectthermalent: -1540.119017 hartree
zpe.sumelectthermalfe: -1540.199373 hartree
dipole: 5.8098 1.8187 -3.6398
dipole: 7.0929
quadrupole: -173.2101 -149.1202 -162.0188
quadrupole: 8.1524 -8.6454 -5.1578
quadrupole: -11.7604 12.3295 -0.5691 8.1524 -8.6454 -5.1578
hfenergy: -1540.4663624 hartree
pointgroup: C01[X(C17H18N2O5S1)]
dipole: 2.3121405 1.5624625 -0.0036858 debye
polarizability: 337.9019416|-16.6781236|205.0000239|36.2088749|29.541373|196.8159227 unknown
InChI: InChI=1S/C17H18N2O5S/c1-13(14-5-3-2-4-6-14)18(11-16-12-24-16)25(22,23)17-9-7-15(8-10-17)19(20)21/h2-10,13,16H,11-12H2,1H3
charge 0 multiplicity 1
43 atoms
S  0.050631 -1.316458 0.278215
O  -0.835268 1.756936 2.696665
O  -0.151652 -1.933474 1.774912
O  0.702978 -2.258943 -0.892433
O  -6.2025 1.069501 -1.034561
O  -5.879996 -0.215705 -2.891264
N  0.880554 0.424266 0.542437
N  -5.493347 0.275877 -1.762891
C  0.67546 1.735053 2.649302
C  1.334164 0.55179 1.946922
C  -0.06925 2.816422 1.931185
C  1.859696 0.889826 -0.509673
C  3.301216 0.377619 -0.373643
C  1.28953 0.727385 -1.935682
C  -1.641241 -0.775337 -0.365821
C  4.337628 1.305351 -0.095256
C  3.633274 -0.993546 -0.53444
C  -2.414592 0.082378 0.436493
C  -2.063262 -1.31073 -1.593702
C  5.681912 0.881844 0.015347
C  4.975277 -1.417327 -0.418128
C  -3.697747 0.430815 -0.034763
C  -3.347796 -0.960666 -2.058625
C  6.003735 -0.484652 -0.144581
C  -4.137783 -0.096261 -1.269916
H  1.13016 1.975329 3.62138
H  1.063961 -0.371171 2.502434
H  2.436077 0.658569 2.002742
H  -0.183268 2.73628 0.843684
H  -0.123546 3.822709 2.362564
H  1.888501 1.982801 -0.301109
H  1.924105 1.288532 -2.642714
H  0.263495 1.133448 -1.992157
H  1.278654 -0.327264 -2.255241
H  4.094006 2.369145 0.028002
H  2.844463 -1.724989 -0.747597
H  -2.023501 0.484879 1.380295
H  -1.40621 -1.981028 -2.156466
H  6.470433 1.612408 0.227696
H  5.218714 -2.478457 -0.542075
H  -4.351674 1.096526 0.533947
H  -3.741178 -1.342223 -3.003991
H  7.043092 -0.820156 -0.056796
