program: Gaussian 09
title: 000186377
version: EM64L-G09RevD.01
frameworkgroup: C1[X(C12H18O)]
method: RPBEPBE
basis: SDD
operation: Freq
keyword: #pfreq=noraman
keyword: PBEPBE/SDD
title: #p freq=noraman PBEPBE/SDD
converged: YES YES NO NO
title: Mulliken charges:
elementType: O C C C C C C C C C C C C H H H H H H H H H H H H H H H H H H
charge: -0.305855 0.064850 -0.594529 0.056133 0.491859 -0.708648 -0.670174 -0.694614 -0.382623 -0.435504 -0.234431 -0.226324 -0.245149 0.191034 0.222799 0.197040 0.173196 0.227245 0.209494 0.216238 0.205462 0.215883 0.229052 0.198141 0.229315 0.220572 0.254637 0.227457 0.222122 0.220774 0.224547
chargesum: 0.00000
title: Mulliken charges with hydrogens summed into heavy atoms:
elementType: O C C C C C C C C C C C C
charge: -0.305855 0.255883 -0.174689 0.229329 0.491859 -0.055671 -0.019776 -0.046586 -0.127987 -0.208047 -0.012309 -0.005550 -0.020602
polarizability: 1.49095904e+02 1.08979386e+01 1.36123141e+02 -1.50127815e+01 9.70219597e+00 1.01940319e+02
1716.lowfreq: -14.5835 -1.8226 -0.0005 0.0004 0.0004 14.7612 23.9809 46.4702 47.4844
frequency: 22.4295 46.2299 47.1557 79.4337 108.4637 175.8951 206.6690 215.4146 226.1533 249.5991 278.0002 325.6098 344.8988 392.3351 403.7255 410.6385 443.5073 481.4954 518.2312 592.0080 617.1243 703.1129 743.2351 753.8340 809.6439 850.8826 854.2894 886.3201 903.6045 916.4588 919.3510 938.0295 954.8585 972.0953 989.8376 991.1739 1025.9994 1028.8085 1081.6605 1096.4176 1110.5633 1116.2246 1146.3126 1169.9932 1175.7726 1186.4776 1209.6691 1218.3598 1283.3316 1303.5624 1326.9138 1327.4026 1334.4250 1352.8522 1377.4450 1380.7783 1382.6464 1391.4087 1439.1003 1454.2045 1455.6386 1464.4451 1466.6423 1469.7627 1474.9376 1482.6346 1486.1895 1591.7154 1613.4107 2934.7099 2955.0322 2978.3261 2982.0327 2989.2685 2991.4666 3049.4801 3072.9990 3075.4629 3085.1242 3086.1744 3091.9184 3097.5364 3109.1653 3121.0711 3134.5607 3149.6253 3162.1054
redmass: 3.7110 3.1006 3.2109 3.0214 4.1400 2.5087 1.0215 1.2504 2.3249 1.3172 2.4614 2.3539 2.4728 2.6237 2.8109 2.8960 2.8906 2.3767 2.9447 4.1802 6.2459 1.7589 2.5245 2.0016 3.2182 1.2495 2.7449 1.6763 1.9194 1.2169 1.4496 1.3943 2.9237 1.3951 4.8043 1.3891 2.2598 2.0645 1.7514 2.1775 1.7752 1.9523 1.9889 1.0611 1.8112 1.1224 1.5541 2.0690 1.3624 1.1836 1.3807 1.3170 1.5024 1.2970 1.2955 1.2314 6.0213 1.2261 2.1469 1.0949 1.0514 1.0518 1.0650 1.0510 1.0507 2.2610 1.0607 6.0454 6.1586 1.0834 1.0831 1.0364 1.0357 1.0356 1.0593 1.1018 1.0987 1.0988 1.1003 1.1000 1.0997 1.1001 1.0868 1.0864 1.0925 1.0956 1.1006
irintensity: 0.0486 0.7314 0.1516 0.8439 3.1374 1.0229 0.0194 0.0683 1.1053 0.2135 0.4686 0.8420 0.2631 4.3240 0.0950 6.8955 1.7719 4.0467 13.3913 6.3830 0.2941 55.3355 0.9430 47.2767 3.2741 0.2306 5.7047 4.5491 3.1983 1.6099 0.6018 0.0604 51.8218 0.2135 0.3707 0.1289 14.9010 31.3114 47.8877 4.0679 67.2492 19.6110 15.1872 0.2169 15.5915 0.1841 5.2925 0.5439 1.9989 35.2781 5.0000 4.3882 9.5756 0.5010 25.3517 24.7460 0.1551 25.2818 7.8778 6.6917 4.6214 3.2357 7.7747 8.2734 9.0469 16.9522 21.1895 0.9924 7.1324 49.6317 26.4472 25.3843 20.7480 23.8594 42.9335 12.3996 39.7014 37.4919 25.3660 15.7290 66.0107 35.7926 10.5452 0.4599 31.8211 37.8022 14.2276
temp: 298.150 k
press: 1.00000 atm
elementType: 8 6 6 6 6 6 6 6 6 6 6 6 6 1 1 1 1 1 1 1 1 1 1 1 1 1 1 1 1 1 1
symmnumber: 1
zpe: 704980.3 jmol-1
zpe.correction: 0.268513 hartree
zpe.thermalcorrener: 0.282620 hartree
zpe.thermalcorrenthalpy: 0.283564 hartree
zpe.thermalcorrgfe: 0.226531 hartree
zpe.sumelectzpe: -542.286223 hartree
zpe.sumelectthermal: -542.272116 hartree
zpe.sumelectthermalent: -542.271172 hartree
zpe.sumelectthermalfe: -542.328204 hartree
dipole: 0.9680 0.3475 1.3812
dipole: 1.7220
quadrupole: -77.0259 -74.3028 -80.3836
quadrupole: 0.8647 -0.3961 2.4796
quadrupole: 0.2115 2.9346 -3.1461 0.8647 -0.3961 2.4796
hfenergy: -542.5547357 hartree
pointgroup: C01 [X(C12H18O1)]
dipole: 0.3766179 -0.0837263 -0.5569212 debye
polarizability: 149.7155114|-11.8055756|133.8477428|13.3792662|12.8185406|103.5961093 unknown
InChI: InChI=1S/C12H18O/c1-10(2)13-11(3)9-12-7-5-4-6-8-12/h4-8,10-11H,9H2,1-3H3
charge 0 multiplicity 1
31 atoms
O  1.828828 -0.061995 0.425119
C  1.315605 -1.234568 -0.315579
C  0.042126 -1.698963 0.436652
C  2.642847 0.888053 -0.372505
C  -1.138863 -0.752019 0.291499
C  2.386148 -2.342417 -0.369927
C  1.744723 1.789433 -1.243403
C  3.458542 1.686334 0.65273
C  -1.213151 0.440547 1.058181
C  -2.183669 -1.029982 -0.627891
C  -2.300303 1.330157 0.90771
C  -3.272593 -0.140871 -0.783433
C  -3.334591 1.043827 -0.014494
H  1.034283 -0.932261 -1.347849
H  0.32341 -1.8120 1.501326
H  -0.229865 -2.70338 0.059393
H  3.335879 0.311885 -1.026247
H  2.625533 -2.692469 0.650248
H  2.031542 -3.205152 -0.964764
H  3.319104 -1.972588 -0.832744
H  2.35981 2.495414 -1.832622
H  1.13457 1.199543 -1.950921
H  1.055571 2.367628 -0.602944
H  4.097828 2.433193 0.147752
H  4.098128 1.012827 1.24846
H  2.778693 2.217127 1.343237
H  -0.40514 0.667162 1.761553
H  -2.147466 -1.952478 -1.221984
H  -2.343374 2.245044 1.510335
H  -4.072074 -0.374889 -1.496106
H  -4.179778 1.732258 -0.128982
