program: Gaussian 09
title: 000186376
version: EM64L-G09RevD.01
frameworkgroup: C1[X(C15H24)]
method: RPBEPBE
basis: SDD
operation: Freq
keyword: #p
keyword: freq=noraman
keyword: PBEPBE/SDD
title: #p freq=noraman PBEPBE/SDD
converged: NO YES NO NO
title: Mulliken charges:
elementType: C C C C C C C C C C C C C C C H H H H H H H H H H H H H H H H H H H H H H H H
charge: -0.090032 -0.237190 -0.044442 -0.225475 -0.467423 0.496838 -0.429472 -0.478483 -0.781898 -0.773951 -0.518460 -0.372143 -0.244245 -0.209060 -0.699858 0.191429 0.199019 0.219013 0.228393 0.203692 0.197703 0.191100 0.200870 0.210310 0.209522 0.232481 0.212063 0.220983 0.213969 0.215609 0.215754 0.228968 0.230778 0.188956 0.216160 0.215208 0.209891 0.207292 0.216128
chargesum: 0.00000
title: Mulliken charges with hydrogens summed into heavy atoms:
elementType: C C C C C C C C C C C C C C C
charge: 0.101397 -0.038171 0.174571 0.002918 -0.066028 0.496838 -0.037502 -0.058650 -0.116370 -0.128618 -0.289492 0.047591 -0.028086 0.006148 -0.066547
polarizability: 1.61228778e+02 -7.01787341e+00 1.77382092e+02 -1.10700520e+01 -3.29928204e+00 1.32393562e+02
1716.lowfreq: -16.6916 -10.9866 -0.0004 -0.0003 0.0004 9.2127 39.2752 54.7680 67.1064
frequency: 38.7229 54.6195 67.0111 78.5979 112.7783 148.4025 162.3463 192.7363 217.9018 229.2414 234.8518 248.8078 258.4962 288.2349 320.3218 339.3000 372.0208 390.7344 459.0849 469.6479 504.7674 530.9178 562.2782 612.8822 655.0953 703.3726 706.0147 737.4050 762.4886 792.3948 858.9882 881.4205 890.1875 899.0922 909.2883 925.6937 954.9002 964.2762 977.1933 989.0838 999.3710 1014.4507 1030.3829 1052.1211 1055.7209 1068.6712 1075.6787 1090.7792 1098.0013 1108.5878 1119.3913 1157.9012 1169.5424 1185.6517 1203.7732 1210.9100 1219.5418 1243.3490 1253.5987 1258.1340 1283.2059 1291.5121 1299.3005 1304.3585 1322.1488 1327.2430 1334.8608 1343.6114 1351.1738 1354.0960 1368.7904 1383.5987 1387.7766 1389.1144 1392.5951 1450.5475 1462.0499 1463.3707 1471.3199 1474.4029 1476.4321 1477.3944 1484.2832 1486.3296 1489.9330 1605.1832 1649.1256 2891.4122 2914.4080 2947.7032 2952.7322 2957.5169 2962.6414 2965.2021 2968.4052 2969.6108 2970.4290 2978.2407 3008.2846 3014.3362 3021.1908 3033.3815 3061.6955 3062.5853 3067.2465 3067.5050 3070.1123 3078.6680 3098.9478 3114.2461 3143.1664
redmass: 2.2142 1.9754 3.3338 2.7890 2.9684 1.7793 2.7830 1.2420 1.4629 1.1299 2.0223 2.7191 2.2681 2.1770 2.8715 2.6888 3.6903 3.3026 2.5751 3.5000 2.9388 2.8377 2.9274 2.7981 3.0995 1.9647 1.7218 1.2048 2.4189 2.0972 1.3264 1.8693 1.7215 1.7215 1.6140 2.2579 1.7133 1.4304 1.6047 2.4334 2.0529 1.8278 1.9444 1.9638 2.2120 1.9514 2.1556 1.8836 2.0847 1.8569 2.3064 1.1600 1.6935 2.4490 1.4025 1.4109 1.3898 1.3596 1.2079 1.3409 1.1305 1.3144 1.2611 1.2744 1.4144 1.6031 1.5506 1.4729 1.5476 1.4810 1.6019 1.2335 1.2150 1.5387 1.3700 1.0887 1.0771 1.0773 1.0509 1.0558 1.0479 1.0447 1.0629 1.0801 1.0514 8.5922 6.0207 1.0791 1.0696 1.0810 1.0740 1.0712 1.0683 1.0677 1.0632 1.0382 1.0368 1.0385 1.0952 1.0943 1.0968 1.1019 1.0990 1.0990 1.0994 1.1001 1.0991 1.0989 1.0871 1.0878 1.1008
irintensity: 0.0092 0.0012 0.0076 0.0691 0.2324 0.4166 0.8552 0.2463 0.4754 0.0127 0.2549 0.0612 0.1319 0.0429 1.0986 1.0052 0.9091 0.1488 0.6013 0.9014 4.4810 3.5920 0.8115 2.7573 2.9031 26.4480 41.5285 7.1632 10.3042 4.2851 0.1376 9.3011 2.5931 3.2074 1.7308 3.0790 1.6274 0.6676 2.1309 3.5518 4.1364 2.7769 3.9739 3.4941 2.0101 7.6819 1.2612 10.2284 2.9082 0.9944 0.9425 0.4263 8.2639 1.4011 6.8369 4.1724 0.1468 2.5120 3.2551 1.8171 2.2885 1.5005 0.4965 2.0418 0.8817 4.4308 0.9701 0.9966 3.2495 2.5959 2.3016 15.8582 11.7556 7.7793 12.9164 2.4067 1.5784 7.0328 13.1987 3.7615 15.3179 9.4450 8.2167 10.2949 1.8900 13.4110 1.9224 12.0510 51.1879 12.2024 18.6782 27.7343 10.7768 66.2483 54.4926 55.8688 45.1861 33.2100 8.1610 5.6317 77.2892 29.2477 51.5263 12.9699 36.4567 112.5658 48.5389 42.7149 16.6365 22.3463 52.1251
temp: 298.150 k
press: 1.00000 atm
elementType: 6 6 6 6 6 6 6 6 6 6 6 6 6 6 6 1 1 1 1 1 1 1 1 1 1 1 1 1 1 1 1 1 1 1 1 1 1 1 1
symmnumber: 1
zpe: 918496.3 jmol-1
zpe.correction: 0.349837 hartree
zpe.thermalcorrener: 0.365909 hartree
zpe.thermalcorrenthalpy: 0.366853 hartree
zpe.thermalcorrgfe: 0.306776 hartree
zpe.sumelectzpe: -584.791464 hartree
zpe.sumelectthermal: -584.775392 hartree
zpe.sumelectthermalent: -584.774447 hartree
zpe.sumelectthermalfe: -584.834524 hartree
dipole: 0.2708 -0.6051 -0.4651
dipole: 0.8098
quadrupole: -94.5400 -93.4341 -93.8087
quadrupole: 0.4034 -2.7728 -1.9884
quadrupole: -0.6124 0.4935 0.1189 0.4034 -2.7728 -1.9884
hfenergy: -585.1413005 hartree
pointgroup: C01 [X(C15H24)]
dipole: -0.2235177 0.1340632 -0.1832145 debye
polarizability: 173.1883754|-10.071219|165.1245875|7.2975019|9.3757581|132.6914695 unknown
InChI: InChI=1S/C15H24/c1-4-7-14-12(3)11(2)10-13-8-5-6-9-15(13)14/h5-6,9,11-14H,4,7-8,10H2,1-3H3
charge 0 multiplicity 1
39 atoms
C  -1.77435 0.637541 0.693515
C  -0.237395 0.925548 0.721311
C  -2.175379 0.016844 -0.682006
C  0.146968 -1.15489 -0.823823
C  -1.398253 -1.295472 -0.93671
C  0.576971 -0.321602 0.3909
C  0.13965 2.114624 -0.229919
C  0.792657 -2.570576 -0.831784
C  -2.193695 -0.219196 1.912245
C  -3.697846 -0.20204 -0.828229
C  1.7569 -0.607222 1.028393
C  1.515062 2.748534 0.073498
C  2.231665 -2.597427 -0.350571
C  2.651902 -1.682006 0.572721
C  1.857132 3.910352 -0.884784
H  -2.294778 1.616228 0.777665
H  0.028681 1.249952 1.750294
H  -1.874662 0.747157 -1.462938
H  0.498599 -0.601382 -1.727219
H  -1.653185 -1.689735 -1.941176
H  -1.736091 -2.060442 -0.20753
H  -0.644808 2.89495 -0.135545
H  0.124573 1.784383 -1.287859
H  0.704145 -3.011585 -1.843242
H  0.193947 -3.229226 -0.160136
H  -1.666528 -1.190239 1.932589
H  -1.942221 0.30751 2.852085
H  -3.28056 -0.416663 1.921892
H  -3.951949 -0.514563 -1.858726
H  -4.064062 -0.990202 -0.144459
H  -4.259903 0.725473 -0.608236
H  2.082178 0.019143 1.870037
H  2.29974 1.970213 0.010174
H  1.522187 3.117047 1.120232
H  2.892676 -3.403119 -0.693744
H  3.6675 -1.728392 0.98511
H  1.891708 3.561319 -1.93435
H  1.098988 4.714233 -0.824291
H  2.84084 4.354632 -0.645286
