program: Gaussian 09
title: 000186384
version: EM64L-G09RevD.01
frameworkgroup: C1[X(C11H14BrN3O3)]
method: RPBEPBE
basis: SDD
operation: Freq
keyword: #p
keyword: freq=noraman
keyword: PBEPBE/SDD
title: #p freq=noraman PBEPBE/SDD
converged: YES YES NO NO
title: Mulliken charges:
elementType: Br O O O N N N C C C C C C C C C C C H H H H H H H H H H H H H H
charge: 0.054917 -0.276630 -0.215777 -0.168917 -0.411309 -0.443395 -0.042369 0.143368 -0.690634 -0.689337 -0.747136 0.202918 0.171871 0.340940 -0.384362 -0.011719 0.224795 -0.801466 0.256277 0.218737 0.216444 0.216573 0.255147 0.219514 0.218853 0.241082 0.221457 0.386714 0.425921 0.259630 0.303996 0.303897
chargesum: 0.00000
title: Mulliken charges with hydrogens summed into heavy atoms:
elementType: Br O O O N N N C C C C C C C C C C C
charge: 0.054917 -0.276630 -0.215777 -0.168917 -0.024595 -0.017474 -0.042369 0.143368 0.000824 0.001897 -0.065743 0.202918 0.171871 0.340940 -0.124733 -0.011719 0.224795 -0.193574
polarizability: 2.16033315e+02 3.80922548e+00 2.06745473e+02 -2.29385228e-02 -6.89910355e-02 9.17732068e+01
1716.lowfreq: -5.5674 -3.3848 -0.0005 0.0006 0.0006 2.5208 17.6968 25.0413 45.5042
frequency: 17.6007 25.0345 45.4969 50.7625 62.3781 84.1454 121.9091 127.1795 157.8112 160.9526 195.3203 200.7381 218.4998 247.4388 259.2589 285.3415 298.7885 310.8948 333.8707 358.7540 366.6912 403.5186 437.4540 445.9433 501.5882 559.3887 561.8761 631.8656 633.9320 655.9870 665.9465 719.4027 721.9515 725.7645 767.6085 803.0971 849.8836 860.7860 900.6035 903.3191 925.1658 932.4963 940.3686 951.0615 953.9235 1013.8142 1022.9526 1025.5223 1058.4140 1108.7739 1131.8021 1156.1366 1200.9610 1204.2228 1229.8895 1236.0710 1253.0364 1260.9931 1374.8461 1377.5137 1382.8769 1405.5762 1410.0431 1426.0781 1457.2647 1469.7924 1471.3434 1478.3401 1489.8419 1495.1942 1503.5999 1540.4036 1589.1488 1595.8314 1612.2796 1617.3005 2969.1531 2984.2026 2986.3069 3037.1302 3061.0029 3078.4774 3079.0919 3084.5034 3101.5848 3105.6323 3110.9384 3186.0587 3220.9493 3530.0339
redmass: 3.1427 6.9455 3.2925 7.8669 4.8003 9.5878 6.1534 5.2141 5.8244 10.8827 5.1807 1.3019 2.6474 2.3399 1.3588 3.5440 4.4123 1.0598 4.6757 3.3742 2.4395 11.5227 4.1566 3.1576 6.6572 7.3940 4.3436 3.4745 6.0324 6.2587 3.1729 6.9155 3.2783 2.7836 2.1576 3.7694 4.5383 1.7600 5.6185 1.7779 1.7211 3.0501 1.9919 1.1002 1.2330 2.7679 1.5470 1.4496 3.4779 3.4930 1.1344 2.1617 2.9231 1.9968 2.9866 1.6557 1.8858 2.2430 1.1902 1.2610 3.3858 1.2149 1.0968 4.1356 1.0475 1.1155 1.0684 1.0771 2.4762 1.0484 1.1328 4.7538 5.5392 6.6027 8.4155 7.3813 1.0373 1.0350 1.0358 1.0569 1.1008 1.1005 1.0985 1.0982 1.1007 1.0999 1.1061 1.0932 1.0824 1.0770
irintensity: 0.0064 0.0276 8.9675 0.8619 3.0541 7.6621 9.7190 0.7102 0.6183 2.2651 0.5649 1.3902 4.3018 0.7699 2.0940 0.0285 35.4194 0.5538 6.8388 9.2780 0.7344 0.3088 0.8633 1.9271 8.6840 3.3165 13.9205 0.0087 18.4997 16.5247 7.3987 2.5435 8.7558 10.8516 60.5116 3.5076 1.9661 36.3748 24.2024 0.0134 4.2514 30.8835 6.0373 93.3233 2.2284 23.0911 1.9175 0.6497 0.6061 255.6238 3.0737 92.0640 3.4578 76.0858 11.4557 47.7196 3.8973 41.7776 20.1202 22.2872 56.2135 2.1387 24.2607 414.4169 1.0803 6.0608 3.0849 29.3945 121.8779 15.7323 144.1022 778.7825 126.9587 260.8217 37.3313 203.6938 19.3982 31.6558 18.1873 23.3070 22.3074 21.8377 1.3354 75.1059 1.7821 27.0713 0.0293 2.9669 323.9340 66.4230
temp: 298.150 k
press: 1.00000 atm
elementType: 35 8 8 8 7 7 7 6 6 6 6 6 6 6 6 6 6 6 1 1 1 1 1 1 1 1 1 1 1 1 1 1
symmnumber: 1
zpe: 637111.5 jmol-1
zpe.correction: 0.242663 hartree
zpe.thermalcorrener: 0.261449 hartree
zpe.thermalcorrenthalpy: 0.262394 hartree
zpe.thermalcorrgfe: 0.192484 hartree
zpe.sumelectzpe: -829.633189 hartree
zpe.sumelectthermal: -829.614403 hartree
zpe.sumelectthermalent: -829.613459 hartree
zpe.sumelectthermalfe: -829.683369 hartree
dipole: -3.8623 -2.0692 -0.0054
dipole: 4.3816
quadrupole: -87.5869 -152.7359 -113.5440
quadrupole: 12.7726 0.0044 0.0179
quadrupole: 30.3687 -34.7803 4.4116 12.7726 0.0044 0.0179
hfenergy: -829.8758524 hartree
pointgroup: C01 [X(C11H14Br1N3O3)]
dipole: -1.7027364 0.0943318 0.252028 debye
polarizability: 216.3041108|-11.3019451|100.3651683|-2.7604041|-28.0760052|197.8827162 unknown
InChI: InChI=1S/C11H14BrN3O3/c1-11(2,3)9(18)15-10-13-6(7(16)5-12)4-8(17)14-10/h4,13,15H,5H2,1-3H3
charge 0 multiplicity 1
32 atoms
Br 4.823584 -0.86365 3.171183
O  -1.846473 0.279105 1.323721
O  2.414808 1.127399 -3.399422
O  1.837048 -0.365106 2.414448
N  -1.545034 0.844163 -0.910391
N  0.536684 0.362026 0.160175
N  0.413733 0.990494 -2.163203
C  -3.87611 0.812504 0.037126
C  -4.548837 -0.53061 0.449258
C  -4.301865 1.932781 1.033249
C  -4.303206 1.195527 -1.401744
C  -2.353555 0.621664 0.207305
C  -0.141197 0.731787 -0.986528
C  1.925788 0.241015 0.105889
C  2.58273 0.493798 -1.081839
C  1.834146 0.890858 -2.301182
C  2.563198 -0.168359 1.407478
C  4.084508 -0.317489 1.401126
H  -4.230255 -0.82651 1.46252
H  -5.647327 -0.411639 0.442647
H  -4.286392 -1.344362 -0.251547
H  -3.849934 2.905464 0.764981
H  -3.990336 1.675056 2.059331
H  -5.400632 2.046668 1.013036
H  -3.8780 2.165381 -1.724911
H  -5.401337 1.304326 -1.432343
H  -4.038504 0.415069 -2.140929
H  -1.965076 1.118323 -1.802476
H  -0.007692 0.18275 1.031104
H  3.668519 0.412871 -1.171942
H  4.397532 -1.090266 0.679688
H  4.568985 0.638164 1.140891
