program: Gaussian 09
title: 000186375
version: EM64L-G09RevD.01
frameworkgroup: C1[X(C21H16O3)]
method: RPBEPBE
basis: SDD
operation: Freq
keyword: #pfreq=noraman
keyword: PBEPBE/SDD
title: #p freq=noraman PBEPBE/SDD
converged: YES YES NO NO
title: Mulliken charges:
elementType: O O O C C C C C C C C C C C C C C C C C C C C C H H H H H H H H H H H H H H H H
charge: -0.439761 -0.422227 -0.214010 -0.311382 0.118714 0.253330 -0.496336 -0.240086 -0.472107 0.271078 0.016074 0.503617 -0.677958 -0.010049 -0.448986 0.163208 0.494719 0.477974 -0.499176 -0.529873 -0.483412 -0.469031 -0.464429 -0.244176 0.275219 0.215216 0.232655 0.246215 0.249166 0.236196 0.266626 0.260698 0.245967 0.236256 0.238594 0.331817 0.243972 0.242105 0.227919 0.375664
chargesum: 0.00000
title: Mulliken charges with hydrogens summed into heavy atoms:
elementType: O O O C C C C C C C C C C C C C C C C C C C C C
charge: -0.107944 -0.046563 -0.214010 -0.036163 0.118714 0.253330 -0.048465 0.006129 0.013255 0.271078 0.016074 0.503617 -0.411332 -0.010049 -0.188288 0.163208 0.494719 0.477974 -0.253209 -0.293617 -0.244818 -0.225059 -0.222325 -0.016257
polarizability: 3.79577256e+02 2.28476627e+01 2.60574235e+02 -3.87282827e+00 2.06351699e+01 1.25176662e+02
1716.lowfreq: -10.0620 -0.0008 -0.0005 -0.0004 5.3686 6.9834 29.6497 44.9452 50.5811
frequency: 29.5983 44.8484 50.5610 66.7914 107.3354 138.8849 154.7219 182.8050 202.7235 217.5396 233.7405 264.6942 271.5923 286.3235 315.1384 321.6391 363.9153 405.5110 415.5895 426.4167 458.4913 479.7146 508.1265 511.5087 516.8491 530.8757 537.9036 547.1745 573.4796 595.3871 610.6959 623.9058 647.0263 693.4506 704.0074 721.7201 738.7167 749.3017 759.3921 770.3877 800.2702 810.8348 828.0340 838.0445 851.5323 862.6772 871.4823 901.1579 911.4092 917.7418 924.7978 969.0104 977.2392 987.2438 991.8913 996.8508 1017.6109 1038.2144 1048.8270 1077.9216 1113.5381 1116.6364 1125.3717 1161.5016 1169.5789 1179.0620 1188.2903 1197.9623 1216.7832 1217.6309 1235.4012 1239.3464 1257.7732 1274.4102 1293.9024 1319.3642 1330.0204 1342.9047 1352.5739 1357.7929 1370.9889 1373.3956 1389.1470 1412.2681 1427.5020 1433.3489 1439.7062 1454.1208 1466.8328 1471.7768 1490.3598 1496.9382 1556.5947 1590.5960 1606.8696 1607.5325 1637.0113 1662.0388 2983.0886 3010.5021 3041.7127 3042.5235 3050.3729 3073.5394 3121.9649 3123.6364 3126.1062 3130.5211 3133.0114 3146.7742 3157.4242 3159.4283 3503.5114 3550.9598
redmass: 9.4671 6.1183 5.2585 5.6151 6.2960 4.3100 5.5056 4.6734 3.9778 2.9409 1.8477 2.8932 2.8645 3.8425 3.9770 5.1518 5.3475 3.3639 3.0878 4.6549 5.0781 5.5778 5.0450 3.9055 4.0587 4.6128 4.0013 3.4536 4.4797 4.9239 3.4269 1.5122 4.4991 3.6371 3.7494 4.0018 3.1475 4.3271 3.8998 1.2756 4.1311 4.2185 1.4922 3.1881 3.7618 4.8433 2.1710 2.8020 1.6122 2.2247 1.7199 4.6802 1.3437 1.3831 1.4103 4.1003 3.4292 2.7162 1.8636 2.0134 2.2869 1.8429 2.0035 1.2459 1.4601 1.3025 1.3579 1.3093 1.6727 1.3561 1.5548 1.7316 1.8293 1.9441 1.5910 1.7867 2.5622 1.9864 1.4090 1.2564 2.7491 1.5877 3.2488 2.5814 4.8548 4.6726 2.7038 1.0977 3.6799 1.1452 7.0050 3.3432 5.2280 7.3605 6.4262 6.6679 7.4313 8.0418 1.0637 1.0622 1.0853 1.0856 1.0970 1.1024 1.0863 1.0862 1.0880 1.0914 1.0917 1.0983 1.0988 1.0954 1.0639 1.0662
irintensity: 1.1617 0.7503 0.3052 1.7100 0.8659 1.9608 2.7283 1.3109 3.7397 24.8155 60.3110 64.8032 0.0469 13.6739 13.7998 1.8538 1.6027 2.2581 3.1365 3.5214 3.0839 3.8856 4.7087 1.5995 7.3301 3.4954 6.4353 1.5340 5.3587 16.3567 7.9136 102.2409 21.3336 4.0217 12.2726 28.8825 16.1342 10.9709 6.5694 5.3152 26.8511 8.2020 5.6004 7.2326 9.7333 4.7568 88.7283 6.0538 31.7574 43.0431 11.2990 20.0935 2.1619 1.1976 2.3548 59.5398 3.9324 222.1128 56.6758 2.1471 7.1613 4.4211 11.5650 24.4262 10.5479 6.8889 16.5071 20.6556 1.1860 7.2751 0.6623 1.2910 9.9106 4.8492 5.6979 10.7561 1.5547 29.8371 20.0988 43.8443 10.0893 0.8956 3.2085 1.8155 0.9684 0.5606 4.6367 24.6685 3.3021 14.4755 4.1999 0.1381 0.3736 5.6151 6.1912 4.7239 0.3668 165.3090 33.7495 13.2552 29.5349 0.9695 47.8416 20.6167 0.9818 0.5883 5.1972 4.0251 16.9822 33.2776 41.5313 14.5381 25.1962 8.1166
temp: 298.150 k
press: 1.00000 atm
elementType: 8 8 8 6 6 6 6 6 6 6 6 6 6 6 6 6 6 6 6 6 6 6 6 6 1 1 1 1 1 1 1 1 1 1 1 1 1 1 1 1
symmnumber: 1
zpe: 821435.1 jmol-1
zpe.correction: 0.312868 hartree
zpe.thermalcorrener: 0.331267 hartree
zpe.thermalcorrenthalpy: 0.332211 hartree
zpe.thermalcorrgfe: 0.266343 hartree
zpe.sumelectzpe: -1033.917126 hartree
zpe.sumelectthermal: -1033.898727 hartree
zpe.sumelectthermalent: -1033.897783 hartree
zpe.sumelectthermalfe: -1033.963651 hartree
dipole: -0.9792 -2.1316 -1.2552
dipole: 2.6604
quadrupole: -124.6222 -128.0240 -143.8497
quadrupole: -9.2788 -3.8669 3.2990
quadrupole: 7.5431 4.1413 -11.6844 -9.2788 -3.8669 3.2990
hfenergy: -1034.2299942 hartree
pointgroup: C01 [X(C21H16O3)]
dipole: 0.3755339 -0.838611 0.5012785 debye
polarizability: 379.3171326|-23.4744135|260.6664411|-1.7743397|-21.5004026|125.3445802 unknown
InChI: InChI=1S/C21H16O3/c22-17-9-8-15(21(23)24)20-14-7-6-12-3-1-2-11-4-5-13(10-16(17)20)19(14)18(11)12/h1-7,10,15,17,22-23H,8-9H2
charge 0 multiplicity 1
40 atoms
O  -3.325247 2.902174 0.967372
O  -2.958227 -3.260793 -0.307726
O  -3.091238 -1.577354 -1.899108
C  -2.639236 -0.996574 0.486918
C  -1.485811 -0.029031 0.200008
C  -1.738553 1.336471 -0.103099
C  -3.95884 -0.253748 0.85462
C  -3.147154 1.927023 -0.150111
C  -4.264088 0.870289 -0.150502
C  -0.133281 -0.507756 0.246352
C  0.959052 0.403968 0.002992
C  0.684136 1.789518 -0.292167
C  -0.660696 2.221202 -0.339591
C  2.321546 -0.053974 0.049109
C  0.193927 -1.893789 0.525635
C  -2.903391 -1.91225 -0.710787
C  2.611961 -1.435932 0.338354
C  3.407008 0.866821 -0.193571
C  1.789411 2.693504 -0.534214
C  1.505109 -2.334135 0.571134
C  3.097567 2.251091 -0.48582
C  3.964754 -1.871532 0.383069
C  4.744503 0.391005 -0.13979
C  5.018249 -0.964465 0.146358
H  -2.372668 -1.653931 1.332084
H  -3.84165 0.165789 1.873944
H  -4.793227 -0.976917 0.905006
H  -3.249571 2.574297 -1.038158
H  -4.36171 0.444375 -1.166192
H  -5.214005 1.374188 0.100371
H  -0.883636 3.273046 -0.554616
H  -0.61078 -2.615457 0.694877
H  1.563311 3.74262 -0.757224
H  1.723731 -3.387207 0.784824
H  3.927409 2.943551 -0.669335
H  -2.998175 2.483496 1.80461
H  4.18151 -2.923389 0.602831
H  5.568248 1.090528 -0.324348
H  6.05594 -1.313245 0.183233
H  -3.15839 -3.829677 -1.100945
