program: Gaussian 09
title: 000186385
version: EM64L-G09RevD.01
frameworkgroup: C1[X(C13H15N3O6)]
method: RPBEPBE
basis: SDD
operation: Freq
keyword: #p
keyword: freq=noraman
keyword: PBEPBE/SDD
title: #p freq=noraman PBEPBE/SDD
converged: YES YES NO NO
title: Mulliken charges:
elementType: O O O O O O N N N C C C C C C C C C C C C C H H H H H H H H H H H H H H H
charge: -0.241417 -0.309508 -0.163868 -0.219713 -0.245330 -0.290279 -0.453841 -0.390733 -0.043673 -0.134396 0.372799 0.114643 0.166939 -0.370519 -0.011259 -0.355603 0.328164 0.244014 -0.058939 -0.769307 -0.776980 -0.536219 0.301011 0.461761 0.286555 0.226716 0.238978 0.363621 0.235142 0.243757 0.250506 0.296627 0.268605 0.250965 0.251021 0.225362 0.244400
chargesum: 0.00000
title: Mulliken charges with hydrogens summed into heavy atoms:
elementType: O O O O O O N N N C C C C C C C C C C C C C
charge: -0.241417 -0.309508 -0.163868 -0.219713 -0.245330 -0.290279 0.007920 -0.027112 -0.043673 0.166615 0.372799 0.114643 0.166939 -0.083964 -0.011259 0.110091 0.328164 0.244014 0.176202 0.021583 -0.006390 -0.066456
polarizability: 2.34178232e+02 -1.68816858e+01 2.18782826e+02 1.25594239e+01 5.66305585e+00 1.19199079e+02
1716.lowfreq: -49.1247 -5.8145 -3.7700 -0.0006 -0.0004 0.0007 3.0317 20.4905 30.9011
frequency: -49.1191 20.4312 30.8817 33.9092 52.3568 72.3112 73.5849 81.7304 91.9923 93.1640 115.1399 120.8620 136.1784 145.2612 161.3101 181.4348 195.0805 210.8345 240.4773 243.6040 298.4628 316.1231 350.2513 366.0120 371.4383 412.1502 439.5681 500.8012 510.5187 532.6721 549.6612 563.5872 570.3326 576.3543 602.5826 643.0847 659.9217 667.7419 720.6199 725.5470 749.3421 762.2262 825.7805 846.0468 852.7843 871.3993 901.5235 916.1044 918.4150 924.8899 954.7739 971.0935 980.3314 982.1471 996.8786 1006.5846 1023.2312 1039.9715 1040.8768 1054.5064 1065.0647 1151.7462 1176.6899 1182.8228 1226.4671 1236.7397 1244.9282 1267.8081 1283.0344 1287.5826 1324.7008 1339.4855 1373.6282 1386.1590 1392.8706 1428.5723 1430.7277 1452.0115 1455.0649 1460.8849 1463.1357 1465.2362 1493.9055 1546.9282 1584.5956 1603.4150 1615.8124 1637.0578 1651.3302 1664.3202 2996.3494 3002.7604 3033.0517 3054.8975 3081.5795 3090.6264 3093.2499 3102.3367 3121.3585 3141.3567 3143.5384 3195.1426 3206.6440 3275.0290 3520.0127
redmass: 1.0437 5.6345 4.6963 6.9510 7.2555 3.8098 5.5189 4.3183 4.6450 4.3557 3.6491 3.8449 1.4867 2.9191 5.4211 7.3317 5.0037 7.4964 3.7864 5.6496 8.0443 5.4676 3.6502 2.9133 5.2343 2.3802 7.4402 6.0066 5.4486 4.6438 6.6574 6.1425 3.2649 3.2513 4.9344 5.3901 2.6750 2.5441 4.1698 2.7113 3.4648 2.4962 6.0784 6.7650 7.0400 4.9007 1.4005 2.8235 1.5167 1.5275 4.7557 2.2991 1.3725 2.0686 2.0953 1.2085 3.5055 2.2520 2.1598 1.6934 2.7084 1.8713 2.8149 3.3838 2.0599 1.4349 1.7965 1.7698 1.6630 1.2615 1.2036 1.2010 4.0996 1.2292 1.2343 1.1782 2.3289 1.0481 1.5304 1.0973 1.0899 1.0458 2.6272 4.3832 7.9720 5.6418 5.4106 8.8557 4.5498 8.9126 1.0385 1.0367 1.0575 1.0870 1.0980 1.0972 1.0621 1.1014 1.0996 1.0987 1.1012 1.0929 1.1153 1.0830 1.0775
irintensity: 0.4177 1.3026 0.3158 0.3175 1.5101 0.3654 4.4665 0.3095 2.9747 2.5280 0.8026 2.0487 4.2147 2.7850 11.3812 2.8204 5.2346 13.4851 6.1491 2.5710 2.2083 2.4620 8.4131 1.7082 10.1428 0.8375 2.0948 6.5159 4.8780 7.3084 10.4765 20.1559 2.1771 1.7122 1.3131 30.6277 0.8109 32.9049 13.6649 13.7793 41.1110 38.9499 71.1019 78.2435 181.4821 163.6623 29.8126 13.1224 44.4926 30.6752 9.8590 51.0519 97.6373 46.8482 7.0409 11.7358 112.9376 3.4287 7.6262 13.3992 50.3541 9.4287 239.0826 182.6748 19.7801 22.3910 52.5254 200.3891 76.5636 0.0313 2.1515 1.3978 14.2674 46.4231 50.0835 26.7517 246.1061 25.7859 170.5481 55.5035 6.1644 26.4208 164.4688 509.0341 356.6105 107.6503 155.3600 88.0359 6.7723 167.3486 2.6886 9.6417 24.4485 5.6082 7.2097 6.7704 3.5763 4.0136 12.4252 4.3156 8.2862 2.5459 16.4189 384.0190 56.4350
temp: 298.150 k
press: 1.00000 atm
elementType: 8 8 8 8 8 8 7 7 7 6 6 6 6 6 6 6 6 6 6 6 6 6 1 1 1 1 1 1 1 1 1 1 1 1 1 1 1
symmnumber: 1
zpe: 719240.0 jmol-1
zpe.correction: 0.273944 hartree
zpe.thermalcorrener: 0.295987 hartree
zpe.thermalcorrenthalpy: 0.296931 hartree
zpe.thermalcorrgfe: 0.220300 hartree
zpe.sumelectzpe: -1118.339952 hartree
zpe.sumelectthermal: -1118.317910 hartree
zpe.sumelectthermalent: -1118.316966 hartree
zpe.sumelectthermalfe: -1118.393597 hartree
dipole: -2.1681 8.0024 1.6431
dipole: 8.4522
quadrupole: -136.8677 -133.3975 -123.3159
quadrupole: 34.7499 -0.0572 -3.2494
quadrupole: -5.6740 -2.2038 7.8778 34.7499 -0.0572 -3.2494
hfenergy: -1118.6138964 hartree
pointgroup: C01 [X(C13H15N3O6)]
dipole: 1.2047189 -2.5983606 -1.6896804 debye
polarizability: 221.2484472|-43.2606571|168.2935711|20.2109047|36.6093024|182.6181187 unknown
InChI: InChI=1S/C13H15N3O6/c1-4-5-21-12(22-8(3)18)11(20)9-6-10(19)16-13(15-9)14-7(2)17/h4,6,12,14-15H,1,5H2,2-3H3
charge 0 multiplicity 1
37 atoms
O  0.798885 -1.10107 1.924188
O  1.839201 -0.201728 -0.066956
O  1.061233 2.198458 2.225281
O  -3.885799 2.904506 0.82916
O  3.771048 -1.442833 0.370946
O  -0.234961 -1.529694 -2.12226
N  -0.864003 0.347447 -0.255148
N  -2.342132 -0.556029 -1.914333
N  -3.121656 1.144488 -0.536156
C  1.574565 -0.02298 1.403513
C  -0.627927 1.253484 0.786628
C  0.695604 1.238768 1.500299
C  -2.107033 0.355242 -0.854901
C  -1.627999 2.125397 1.16856
C  -2.952207 2.114681 0.507501
C  1.571689 -2.195191 2.627048
C  2.98864 -0.936428 -0.458733
C  -1.442768 -1.440167 -2.508362
C  2.283609 -1.682506 3.852344
C  3.071493 -0.998413 -1.961413
C  -2.018385 -2.271585 -3.642223
C  3.636077 -1.670738 3.971869
H  2.534881 0.11896 1.930839
H  -0.125027 -0.287571 -0.613474
H  -1.447997 2.832794 1.981233
H  0.772093 -2.909687 2.881998
H  2.278969 -2.649337 1.912647
H  -3.302593 -0.486845 -2.264925
H  1.64791 -1.299143 4.662566
H  3.927837 -1.618256 -2.262514
H  3.185067 0.018861 -2.37608
H  2.128798 -1.411926 -2.360997
H  -1.236791 -2.942881 -4.024704
H  -2.371807 -1.626746 -4.467459
H  -2.874226 -2.878792 -3.295601
H  4.127137 -1.303244 4.879923
H  4.282878 -2.029695 3.1620
