program: Gaussian 09
title: 000186369
version: EM64L-G09RevD.01
frameworkgroup: C1[X(C21H16O2)]
method: RPBEPBE
basis: SDD
operation: Freq
keyword: #pfreq=noraman
keyword: PBEPBE/SDD
title: #p freq=noraman PBEPBE/SDD
converged: YES YES NO NO
title: Mulliken charges:
elementType: O O C C C C C C C C C C C C C C C C C C C C C H H H H H H H H H H H H H H H H
charge: -0.423768 -0.216183 -0.314597 0.094779 -0.463863 0.359353 -0.553173 -0.446485 0.266033 0.016108 0.498834 -0.723982 -0.010668 -0.448124 0.496508 0.160904 0.478999 -0.503656 -0.532232 -0.485820 -0.470950 -0.466392 -0.245618 0.271551 0.221409 0.222699 0.220406 0.230824 0.208901 0.255222 0.243651 0.262279 0.241604 0.234718 0.236758 0.242759 0.240620 0.226380 0.374214
chargesum: 0.00000
title: Mulliken charges with hydrogens summed into heavy atoms:
elementType: O O C C C C C C C C C C C C C C C C C C C C C
charge: -0.049554 -0.216183 -0.043046 0.094779 -0.019755 0.359353 -0.101944 0.017638 0.266033 0.016108 0.498834 -0.480330 -0.010668 -0.185846 0.496508 0.160904 0.478999 -0.262053 -0.297515 -0.249063 -0.228190 -0.225772 -0.019238
polarizability: 3.70260971e+02 2.87472250e+01 2.62343767e+02 -1.13852199e+01 1.29622892e+01 1.17680941e+02
1716.lowfreq: -11.6927 -4.8498 -0.0009 -0.0007 -0.0002 2.4513 34.8071 46.6557 52.3287
frequency: 34.8066 46.6214 52.3013 89.6855 118.8991 166.8332 169.0158 209.0746 219.5941 224.2833 281.6832 303.7993 310.6711 338.8905 347.0663 389.3721 420.9806 430.8614 470.9888 487.5691 508.4220 510.8696 516.3430 525.5310 546.6447 558.0017 571.7954 610.3703 621.0252 632.6018 649.1048 699.3870 720.1769 732.4113 748.8750 761.4737 767.9533 803.2282 811.7746 821.7848 834.5668 850.7691 865.6146 880.1231 891.3736 909.0210 916.2559 923.7395 963.1608 974.8034 984.4607 989.4122 994.7986 1013.2429 1034.8055 1070.3408 1079.5743 1104.3241 1116.4238 1127.2637 1159.1735 1171.7105 1173.7139 1184.5402 1197.2778 1215.6673 1232.0522 1235.7852 1257.2772 1263.8148 1281.7017 1293.5095 1326.8273 1331.2376 1342.7583 1352.2244 1366.6714 1370.9260 1389.1597 1412.6081 1427.9808 1433.6244 1439.6795 1455.3978 1466.6507 1471.6313 1474.7162 1490.6729 1497.4933 1559.0283 1591.7652 1606.9492 1608.7492 1636.9984 1661.1683 2955.5831 2985.9081 3001.0044 3024.5336 3036.4287 3046.2383 3064.3795 3111.2609 3118.4725 3121.8916 3124.4968 3131.4844 3143.3309 3156.2833 3160.8433 3503.9622
redmass: 7.8630 5.1473 6.2725 3.8481 4.8992 4.5168 3.5661 4.4666 3.7453 3.9086 3.0492 5.4488 4.4799 3.3174 3.5306 5.3207 3.6202 4.1986 5.4323 3.4958 5.0638 3.8288 4.4077 3.8081 3.2835 4.2240 5.0889 2.0012 3.2450 2.2539 4.6921 3.8450 3.9332 2.6692 5.7464 3.4637 1.2735 4.8842 2.9579 1.6185 2.4834 2.2448 2.9386 2.2760 2.8473 1.6166 1.9717 1.7598 4.0360 1.3460 1.3887 1.4121 4.2566 3.4585 2.7201 1.9924 1.9966 1.8315 2.4680 1.9870 1.2097 1.4726 1.3023 1.4244 1.3086 1.6426 1.5122 1.6851 1.7482 1.3404 1.8986 1.6162 1.6676 2.6688 1.8976 1.4984 1.6729 2.4707 3.2165 2.5408 5.0875 4.6115 2.2379 1.2436 3.0220 1.1941 1.1055 6.6493 3.3146 5.0621 7.4628 6.3521 6.6678 7.4412 7.9815 1.0655 1.0614 1.0635 1.0929 1.0838 1.1008 1.1032 1.0908 1.0861 1.0861 1.0883 1.0916 1.0982 1.0990 1.0948 1.0639
irintensity: 1.1834 0.4059 0.4243 0.9291 0.5123 1.9133 0.0408 3.6724 1.4598 5.5089 1.3324 2.1986 1.9734 1.3367 0.4249 2.1536 1.8913 0.8615 1.0673 1.9018 4.0841 0.7856 9.2890 0.4155 0.9736 11.3859 2.7499 52.4100 25.9012 49.5629 11.3474 3.2157 33.4947 40.1034 0.2800 2.5356 6.9511 5.2935 8.1336 1.6762 5.1996 6.6170 34.0507 38.5632 5.0288 29.5676 21.2834 16.5998 3.7349 2.0144 0.9051 2.4087 19.7096 21.0617 257.3262 4.0711 6.5028 5.6861 0.7073 0.5538 5.7019 0.9614 3.2175 1.2654 18.7319 0.1307 2.3740 1.0610 6.5577 5.2853 10.9771 4.5874 11.8717 1.1067 16.7622 2.8337 5.7018 1.7565 2.2318 3.7130 1.1887 0.3881 11.8039 6.5329 5.1889 10.9149 18.8312 4.8763 0.0839 3.0364 7.7909 6.7181 15.5455 1.7538 166.5752 28.1963 29.7564 42.7484 32.1701 9.6622 51.3020 31.9294 12.7161 2.9649 0.7855 5.7233 17.6066 37.7146 45.4298 11.4343 23.1352
temp: 298.150 k
press: 1.00000 atm
elementType: 8 8 6 6 6 6 6 6 6 6 6 6 6 6 6 6 6 6 6 6 6 6 6 1 1 1 1 1 1 1 1 1 1 1 1 1 1 1 1
symmnumber: 1
zpe: 812396.5 jmol-1
zpe.correction: 0.309425 hartree
zpe.thermalcorrener: 0.326433 hartree
zpe.thermalcorrenthalpy: 0.327377 hartree
zpe.thermalcorrgfe: 0.264703 hartree
zpe.sumelectzpe: -958.782107 hartree
zpe.sumelectthermal: -958.765100 hartree
zpe.sumelectthermalent: -958.764156 hartree
zpe.sumelectthermalfe: -958.826830 hartree
dipole: 0.5153 -0.0998 -1.2973
dipole: 1.3995
quadrupole: -115.8819 -113.8450 -141.4657
quadrupole: -0.5502 -6.0284 -0.7284
quadrupole: 7.8490 9.8858 -17.7348 -0.5502 -6.0284 -0.7284
hfenergy: -959.0915327 hartree
pointgroup: C01 [X(C21H16O2)]
dipole: -0.2043733 0.0409804 -0.5096277 debye
polarizability: 370.4989295|28.3702274|262.2386586|10.5481605|-12.7660731|117.5480913 unknown
InChI: InChI=1S/C21H16O2/c22-21(23)17-6-2-5-14-11-15-8-7-12-3-1-4-13-9-10-16(19(14)17)20(15)18(12)13/h1,3-4,7-11,17,22H,2,5-6H2
charge 0 multiplicity 1
39 atoms
O  -3.28359 2.916618 0.375746
O  -3.364534 1.125039 1.845862
C  -2.839957 0.727522 -0.562661
C  -1.625927 -0.180973 -0.327032
C  -4.11598 -0.063471 -0.984433
C  -1.789979 -1.581627 -0.148127
C  -3.15588 -2.261245 -0.219678
C  -4.342045 -1.288737 -0.078657
C  -0.312323 0.396959 -0.288977
C  0.838934 -0.447552 -0.077829
C  0.657231 -1.865988 0.106459
C  -0.653488 -2.395235 0.068595
C  2.164894 0.108431 -0.046915
C  -0.079396 1.819733 -0.457594
C  2.360813 1.524961 -0.227839
C  -3.168164 1.54733 0.686652
C  3.308492 -0.747366 0.164854
C  1.818744 -2.703392 0.32308
C  1.196578 2.355122 -0.431505
C  3.092286 -2.167177 0.349557
C  3.678689 2.057838 -0.199409
C  4.608602 -0.174906 0.18696
C  4.789689 1.213643 0.005515
H  -2.611486 1.452327 -1.363249
H  -3.979076 -0.394688 -2.032677
H  -4.990947 0.613129 -0.969953
H  -3.232527 -2.787417 -1.194859
H  -3.211204 -3.047503 0.556964
H  -5.283027 -1.799404 -0.355785
H  -4.438501 -0.958954 0.971863
H  -0.793321 -3.474826 0.210258
H  -0.928931 2.493179 -0.60402
H  1.665461 -3.77973 0.464838
H  1.341677 3.433882 -0.564804
H  3.964471 -2.811297 0.51233
H  3.823434 3.135688 -0.337477
H  5.476068 -0.825772 0.347938
H  5.799622 1.637325 0.025699
H  -3.524603 3.418035 1.202305
