program: Gaussian 09
title: 000186443
version: EM64L-G09RevD.01
frameworkgroup: C1[X(C16H18O7)]
method: RPBEPBE
basis: SDD
operation: Freq
keyword: #pfreq=noraman
keyword: PBEPBE/SDD
title: #p freq=noraman PBEPBE/SDD
converged: YES YES NO NO
title: Mulliken charges:
elementType: O O O O O O O C C C C C C C C C C C C C C C C H H H H H H H H H H H H H H H H H H
charge: -0.255773 -0.218859 -0.259088 -0.407158 -0.239541 -0.434638 -0.233672 -0.001346 -0.378359 -0.572453 -0.388836 -0.717916 0.250373 -0.618886 0.175667 0.226524 0.206975 0.193955 -0.365414 -0.357687 -0.216847 -0.216409 0.098307 0.223735 0.199868 0.207296 0.272926 0.274111 0.230728 0.267264 0.212851 0.222962 0.224770 0.287275 0.315278 0.269029 0.272264 0.242299 0.242539 0.378208 0.387678
chargesum: 0.00000
title: Mulliken charges with hydrogens summed into heavy atoms:
elementType: O O O O O O O C C C C C C C C C C C C C C C C
charge: -0.255773 -0.218859 -0.259088 -0.028950 -0.239541 -0.046959 -0.233672 0.222389 0.028805 -0.025415 0.109156 -0.057333 0.250373 -0.016333 0.175667 0.226524 0.206975 0.193955 -0.096385 -0.085423 0.025451 0.026130 0.098307
polarizability: 2.17377257e+02 1.75300317e+01 1.91065361e+02 -6.41735465e+00 2.34906108e+01 1.70445603e+02
1716.lowfreq: -8.4565 -5.1263 -0.0008 -0.0005 -0.0004 5.4470 15.0204 19.7162 22.9046
frequency: 14.9701 19.7058 22.8613 34.6204 41.8946 53.1138 65.0732 78.9337 81.8066 108.2096 120.8640 123.5524 138.3403 145.6778 174.0337 195.7842 231.9752 238.9734 258.3057 275.3439 304.1327 314.0405 340.6530 376.7833 390.4223 396.8767 407.0770 455.4190 466.4355 504.6513 512.1484 529.6997 575.6663 578.9885 594.4073 598.8444 644.2290 649.1235 662.5235 678.6130 710.5414 731.7989 770.3757 775.4229 789.3730 794.3584 796.9361 812.4070 852.1354 888.3673 899.7504 906.0856 927.1239 951.0758 978.3046 1001.9298 1005.5986 1011.0254 1030.5805 1040.5005 1047.0712 1069.5417 1073.2222 1100.7436 1127.0672 1129.8374 1150.0406 1166.4692 1178.3317 1186.4168 1196.6269 1234.9911 1240.7047 1245.7150 1259.9209 1267.9178 1276.5428 1310.8667 1331.5586 1339.5130 1342.0451 1358.6820 1368.4702 1381.6573 1394.1507 1419.9803 1431.4756 1439.1800 1462.7460 1467.8482 1477.2931 1479.9937 1489.9652 1574.9643 1602.9942 1609.1360 1628.9128 1648.5490 1660.1406 2976.0583 2977.8597 2981.0783 2984.1884 2987.1829 3031.2872 3045.1835 3052.9208 3074.4783 3076.6819 3079.4924 3115.6745 3140.7322 3153.0856 3164.2169 3175.6731 3506.8470 3517.4975
redmass: 10.1610 7.3757 8.4855 4.3216 6.8694 3.9270 4.9047 3.8275 4.8469 5.8289 4.5229 3.4055 4.7383 4.2237 5.1626 4.2158 2.0797 2.3289 3.6665 4.4946 4.4182 3.9951 5.4042 3.8699 7.6652 2.7004 3.3979 2.2230 3.3014 2.1256 3.1434 4.4126 1.8625 2.0671 3.3477 4.8685 1.4755 5.3776 4.3409 5.2132 3.7943 5.2592 1.6651 2.5954 1.9391 3.4393 3.5241 2.7039 2.8037 2.1783 3.1798 1.4927 2.1719 1.7863 1.4020 5.2188 1.3626 1.9959 3.5842 2.5803 2.6192 2.0402 1.9827 2.1967 1.6468 1.9384 1.9743 1.6411 1.0612 1.7329 1.4035 1.4893 2.0735 1.5502 1.1380 1.3371 1.5793 2.6096 1.5652 2.1387 1.5178 1.6169 1.3524 10.0221 1.2131 1.0841 2.2687 1.0938 1.1138 1.0724 2.2997 1.0989 1.0546 7.1859 6.5274 9.0308 8.4741 9.1173 7.9932 1.0723 1.0390 1.0668 1.0650 1.0642 1.0992 1.0589 1.0934 1.1004 1.0990 1.0930 1.1080 1.0862 1.0902 1.0950 1.1010 1.0639 1.0642
irintensity: 0.5845 0.7357 0.3790 0.6658 1.6221 1.6392 0.7213 0.2775 3.2991 0.7465 6.9028 2.8218 3.5102 0.5427 6.3092 1.2446 1.0482 0.7491 2.7216 5.0639 0.2288 6.2488 0.4501 11.8847 15.3752 5.1841 4.3158 3.5903 4.5951 8.8772 38.0602 5.1458 64.3135 97.4117 32.7877 24.6282 124.7008 10.7727 17.4480 9.9397 94.6668 4.3402 8.9367 7.9017 41.0703 6.6416 4.9415 10.6103 11.0816 21.1902 7.9372 0.5738 4.2045 16.0088 4.8363 141.1204 2.5700 12.8185 86.2397 239.3901 47.0298 72.4501 94.2584 63.4028 22.5406 9.7183 5.8587 35.9962 0.2092 42.3089 30.9730 35.1176 172.8370 25.5475 19.3639 12.1585 51.0370 109.8778 2.2616 144.4243 17.9544 21.5491 6.6166 12.4571 18.3951 46.6691 4.5283 17.3154 22.7501 8.0104 3.6353 16.9098 5.6764 7.3037 79.6380 199.0354 103.9488 233.4192 173.7899 6.9372 35.3726 21.5521 9.7098 14.9282 16.8803 23.8410 10.9007 57.3444 46.3287 2.0309 9.4688 1.5923 4.3941 4.4348 19.1161 24.3692 32.9191
temp: 298.150 k
press: 1.00000 atm
elementType: 8 8 8 8 8 8 8 6 6 6 6 6 6 6 6 6 6 6 6 6 6 6 6 1 1 1 1 1 1 1 1 1 1 1 1 1 1 1 1 1 1
symmnumber: 1
zpe: 827157.2 jmol-1
zpe.correction: 0.315048 hartree
zpe.thermalcorrener: 0.338506 hartree
zpe.thermalcorrenthalpy: 0.339450 hartree
zpe.thermalcorrgfe: 0.258036 hartree
zpe.sumelectzpe: -1145.377236 hartree
zpe.sumelectthermal: -1145.353778 hartree
zpe.sumelectthermalent: -1145.352834 hartree
zpe.sumelectthermalfe: -1145.434247 hartree
dipole: -2.4416 -1.4908 0.6644
dipole: 2.9369
quadrupole: -128.8565 -127.1877 -135.6689
quadrupole: 8.9589 14.1334 -4.7092
quadrupole: 1.7145 3.3834 -5.0978 8.9589 14.1334 -4.7092
hfenergy: -1145.6922837 hartree
pointgroup: C01 [X(C16H18O7)]
dipole: 0.9814115 0.5920015 0.1465239 debye
polarizability: 217.8944751|14.2284135|193.8040573|0.3422481|-24.6535742|167.1896887 unknown
InChI: InChI=1S/C16H18O7/c1-2-10(7-11(17)8-14(18)19)9-23-16(22)13-6-4-3-5-12(13)15(20)21/h3-6,10,18,20H,2,7-9H2,1H3
charge 0 multiplicity 1
41 atoms
O  0.365133 -1.012981 -0.854149
O  -3.900802 -0.221136 -1.033947
O  -0.436425 1.164118 -1.136904
O  -3.780774 3.246335 2.064894
O  -3.457729 1.069806 2.793932
O  0.979054 -0.321917 1.925544
O  2.956744 -1.52861 2.084972
C  -1.839842 -2.006176 -0.114784
C  -1.189439 -3.090379 0.784204
C  -2.286635 -0.776674 0.711782
C  -0.95233 -1.588757 -1.301912
C  -0.928719 -4.434277 0.069098
C  -3.21332 0.166022 -0.051837
C  -3.263927 1.63678 0.373567
C  0.493947 0.368654 -0.849868
C  1.912664 0.790757 -0.599149
C  -3.494723 1.891002 1.850386
C  2.755862 0.237487 0.40585
C  2.441657 1.751305 -1.495946
C  4.12612 0.597977 0.445871
C  3.801558 2.122989 -1.43376
C  4.651663 1.529754 -0.472782
C  2.277351 -0.649846 1.507298
H  -2.749061 -2.438489 -0.584333
H  -1.859908 -3.266002 1.649317
H  -0.234668 -2.704222 1.191315
H  -2.848474 -1.10493 1.610571
H  -1.419344 -0.215606 1.103778
H  -0.652265 -2.457213 -1.908468
H  -1.463783 -0.841925 -1.93217
H  -1.857029 -4.832305 -0.382616
H  -0.549389 -5.189226 0.781183
H  -0.174378 -4.335008 -0.732133
H  -4.037178 2.163338 -0.211323
H  -2.287958 2.08417 0.090132
H  1.778255 2.186996 -2.249578
H  4.759958 0.148694 1.216931
H  4.196311 2.862138 -2.138555
H  5.711179 1.801913 -0.4290
H  -3.925447 3.398976 3.038781
H  0.712692 -0.926135 2.670508
