program: Gaussian 09
title: 000186347
version: EM64L-G09RevD.01
frameworkgroup: C1[X(C20H14O2)]
method: RPBEPBE
basis: SDD
operation: Freq
keyword: #pfreq=noraman
keyword: PBEPBE/SDD
title: #p freq=noraman PBEPBE/SDD
converged: YES YES NO NO
title: Mulliken charges:
elementType: O O C C C C C C C C C C C C C C C C C C C C H H H H H H H H H H H H H H
charge: -0.245232 -0.245308 -0.008808 -0.008774 0.289633 0.289459 0.524499 0.524492 0.163130 0.163009 -0.427909 -0.427722 -0.507084 -0.506925 -0.533583 -0.533481 -0.384280 -0.384338 0.125921 0.126057 -0.795158 -0.795099 0.318505 0.318577 0.245242 0.245242 0.248170 0.248167 0.246942 0.246930 0.238049 0.238030 0.263789 0.238026 0.238053 0.263778
chargesum: 0.00000
title: Mulliken charges with hydrogens summed into heavy atoms:
elementType: O O C C C C C C C C C C C C C C C C C C C C
charge: -0.245232 -0.245308 -0.008808 -0.008774 0.289633 0.289459 0.524499 0.524492 0.163130 0.163009 -0.109404 -0.109144 -0.261842 -0.261682 -0.285413 -0.285314 -0.137338 -0.137408 0.125921 0.126057 -0.055289 -0.055241
polarizability: 4.42904614e+02 -1.77648317e+01 2.57349904e+02 -2.38121613e-02 4.22981359e-03 9.24485655e+01
1716.lowfreq: -8.6341 -6.9852 -0.0010 0.0004 0.0008 3.6967 25.9423 29.2531 40.1590
frequency: 25.9421 29.2461 40.1589 89.5249 103.6820 157.4850 192.6695 196.3726 203.7700 216.2208 233.0789 266.9538 277.2647 286.8419 324.5532 352.6798 370.1257 405.4275 435.6726 483.8557 486.8019 500.0762 506.1881 518.3491 531.7139 551.4019 562.5188 570.5161 587.1263 604.6887 647.5369 670.8787 686.3014 702.4853 705.2108 753.0833 757.3076 811.3603 820.1569 825.6240 853.0430 864.8474 888.2271 893.5639 934.7144 974.8916 976.2081 978.3096 980.2067 1020.6889 1020.7924 1029.6847 1029.8567 1047.8791 1120.6930 1127.5585 1151.2734 1165.4008 1190.4791 1206.6995 1215.2163 1243.5009 1247.0428 1258.6932 1259.4317 1335.0692 1355.5793 1365.7588 1371.5312 1382.5929 1383.2003 1403.0600 1431.0730 1437.9910 1450.9719 1454.8613 1461.1051 1468.8643 1468.9311 1502.6015 1506.4361 1526.8925 1559.0394 1572.2509 1591.1059 1598.3436 1610.4725 1629.2799 2987.5178 2987.5251 3074.2397 3074.2528 3125.4531 3125.5024 3131.3864 3131.5320 3134.9468 3135.3242 3173.1181 3173.3008 3187.2862 3187.6844
redmass: 3.8391 4.3432 8.0756 5.3969 3.9589 5.2307 2.1138 1.0604 1.4288 7.0040 4.7857 4.1755 3.9330 4.3098 5.2180 5.3735 6.9092 3.8140 5.6797 5.5396 3.6163 5.0177 3.7893 4.0765 3.3919 5.8557 3.0563 4.6841 5.4853 3.0724 5.1833 3.3803 6.6655 5.6183 3.3755 2.5976 5.4637 5.0772 1.3637 1.5375 4.3601 5.6850 1.6007 1.6141 2.6627 1.4171 1.4078 4.3704 1.8406 1.7584 1.7918 1.3523 1.3364 2.8664 2.4133 2.8689 1.9786 1.7160 1.3049 1.5312 1.7103 3.1738 2.9356 1.9489 1.8441 2.9272 2.5186 1.3258 1.4434 5.3297 2.2583 7.0509 3.5433 1.7283 1.1350 1.3027 4.6015 1.0503 1.0503 5.1075 4.2059 4.0631 5.2586 7.1336 7.1862 7.0066 6.2215 7.4232 1.0375 1.0375 1.0975 1.0975 1.0989 1.0989 1.0909 1.0908 1.0895 1.0895 1.0936 1.0936 1.0948 1.0948
irintensity: 9.5253 0.0023 2.4804 0.0000 0.1815 5.9148 4.6182 0.0154 0.0004 0.0000 7.0740 0.0000 0.0000 0.0000 8.4017 0.1876 0.0000 0.0562 0.0000 0.0000 0.9139 2.5314 0.0000 3.6507 0.0000 43.2316 0.0000 0.0000 0.0000 5.7750 0.0000 0.0000 4.5081 35.1416 7.8921 6.6839 0.0000 7.9096 0.0002 12.8992 0.0000 0.0000 0.0056 145.5046 144.9275 3.6859 0.0011 11.7136 0.0015 0.0860 6.5452 0.4828 2.3984 1.3512 0.0000 0.0000 47.4804 0.0001 23.5640 0.0003 54.3813 556.5171 0.0212 0.0602 240.3008 0.0000 27.2253 0.0006 155.3401 0.4706 0.0003 0.0000 0.0001 24.4399 0.0073 80.2270 7.1232 27.8444 11.9415 70.8641 0.0026 0.0001 391.6707 0.0000 73.7169 0.0000 52.7998 0.0001 5.8919 1.3105 9.6768 14.7780 37.0720 1.3054 15.7162 0.0408 26.9828 0.0072 33.0711 2.1924 3.2274 40.0669
temp: 298.150 k
press: 1.00000 atm
elementType: 8 8 6 6 6 6 6 6 6 6 6 6 6 6 6 6 6 6 6 6 6 6 1 1 1 1 1 1 1 1 1 1 1 1 1 1
symmnumber: 1
zpe: 727723.3 jmol-1
zpe.correction: 0.277175 hartree
zpe.thermalcorrener: 0.294637 hartree
zpe.thermalcorrenthalpy: 0.295581 hartree
zpe.thermalcorrgfe: 0.231113 hartree
zpe.sumelectzpe: -919.540445 hartree
zpe.sumelectthermal: -919.522983 hartree
zpe.sumelectthermalent: -919.522039 hartree
zpe.sumelectthermalfe: -919.586507 hartree
dipole: -0.0028 -0.0002 0.0003
dipole: 0.0028
quadrupole: -122.0255 -118.2178 -130.9933
quadrupole: -29.4970 -0.0339 -0.0102
quadrupole: 1.7200 5.5278 -7.2478 -29.4970 -0.0339 -0.0102
hfenergy: -919.8176202 hartree
pointgroup: C01 [X(C20H14O2)]
dipole: -0.001078 0.0001539 -0.0002377 debye
polarizability: 437.4116918|1.9226159|252.924031|49.0949485|21.9628774|102.3673602 unknown
InChI: InChI=1S/C20H14O2/c1-11(21)15-7-3-13-6-10-18-16(12(2)22)8-4-14-5-9-17(15)19(13)20(14)18/h3-10H,1-2H3
charge 0 multiplicity 1
36 atoms
O  4.477373 -1.981392 0.364635
O  -4.47658 1.98161 -0.364041
C  0.65115 0.282937 0.130521
C  -0.651489 -0.28338 -0.130274
C  1.833869 -0.555423 0.185044
C  -1.834181 0.554983 -0.184787
C  0.764807 1.704694 0.338452
C  -0.765221 -1.705118 -0.338205
C  3.120121 0.051149 0.448983
C  -3.120437 -0.051458 -0.448707
C  1.666589 -1.979161 -0.030525
C  -1.667005 1.978704 0.030782
C  -0.419522 2.521291 0.280578
C  0.41909 -2.521722 -0.280324
C  2.041245 2.271119 0.596297
C  -2.041698 -2.271482 -0.596049
C  3.181558 1.460773 0.648609
C  -3.181988 -1.461084 -0.648358
C  4.408939 -0.722642 0.526036
C  -4.408942 0.722843 -0.525624
C  5.708853 0.037137 0.812802
C  -5.709309 -0.036101 -0.812657
H  2.556896 -2.608031 0.011138
H  -2.557375 2.607515 -0.010853
H  -0.31532 3.600782 0.440961
H  0.314859 -3.601211 -0.440695
H  2.124495 3.352168 0.754461
H  -2.124996 -3.352528 -0.754208
H  4.146532 1.93252 0.849814
H  -4.146969 -1.932792 -0.849557
H  5.673702 0.55475 1.789074
H  5.920565 0.794781 0.036068
H  6.52941 -0.695675 0.828038
H  -5.92163 -0.793702 -0.036049
H  -5.674398 -0.553596 -1.788998
H  -6.529392 0.697244 -0.827884
