program: Gaussian 09
title: 000186365
version: EM64L-G09RevD.01
frameworkgroup: C1[X(C23H18O3)]
method: RPBEPBE
basis: SDD
operation: Freq
keyword: #pfreq=noraman
keyword: PBEPBE/SDD
title: #p freq=noraman PBEPBE/SDD
converged: YES YES NO NO
title: Mulliken charges:
elementType: O O O C C C C C C C C C C C C C C C C C C C C C C C H H H H H H H H H H H H H H H H H H
charge: -0.272668 -0.217841 -0.229622 -0.349243 0.243891 -0.481702 0.271985 0.146773 0.010667 -0.533389 0.515539 -0.007545 0.037593 -0.724972 -0.444480 0.494646 0.247657 0.479026 -0.492775 -0.529248 -0.482510 -0.468888 -0.463721 -0.241945 -0.269267 -0.658073 0.271997 0.234502 0.224572 0.247889 0.280463 0.292043 0.261628 0.251324 0.237340 0.240324 0.244712 0.243701 0.229227 0.224611 0.237038 0.218942 0.254397 0.225401
chargesum: 0.00000
title: Mulliken charges with hydrogens summed into heavy atoms:
elementType: O O O C C C C C C C C C C C C C C C C C C C C C C C
charge: -0.272668 -0.217841 -0.229622 -0.077246 0.243891 -0.022628 0.271985 0.146773 0.010667 -0.005037 0.515539 -0.007545 0.037593 -0.432929 -0.182852 0.494646 0.247657 0.479026 -0.241451 -0.291908 -0.242186 -0.224175 -0.220021 -0.012718 0.192381 0.040667
polarizability: 3.97637786e+02 4.69881949e+01 3.03010350e+02 1.73463366e+01 -3.09857676e+01 1.42379049e+02
1716.lowfreq: -12.2947 -3.0981 -0.0003 0.0004 0.0005 3.3596 16.6665 32.4980 46.5897
frequency: 16.3006 32.4772 46.5836 59.3325 62.6127 86.4810 127.6983 153.1758 157.7932 182.4121 203.8396 210.6978 224.6632 247.6548 260.6085 292.9105 295.9608 315.5062 334.6425 360.0789 407.3443 423.3407 447.4798 457.0903 467.9832 486.0923 509.6609 512.2136 516.2534 546.0545 549.2202 557.2593 572.9345 591.1018 613.5324 671.2205 685.1349 704.6973 721.2991 740.2314 745.8763 766.1733 773.9323 791.1792 803.8685 812.7084 822.8503 834.0464 857.0856 868.9406 875.6043 902.5693 912.3023 917.9728 938.6014 955.0413 980.0924 984.5043 990.4969 995.5790 1009.2485 1037.0451 1041.5398 1079.5932 1086.4080 1099.2561 1115.5632 1117.7298 1149.4496 1155.3428 1166.3604 1179.7371 1186.5576 1197.4904 1203.4363 1219.5892 1237.9822 1258.3306 1278.4608 1292.0533 1300.2399 1308.5516 1330.3668 1336.3477 1352.9933 1361.3822 1372.2349 1386.7876 1392.1866 1411.4218 1427.9035 1429.8413 1432.7245 1434.3980 1456.8363 1463.5841 1465.2452 1472.1619 1483.4999 1485.6665 1495.9252 1551.5252 1580.1460 1591.4829 1607.3863 1613.8361 1635.3711 1637.0167 2993.8783 2994.9875 2996.2887 3030.8493 3044.9483 3053.4251 3073.8550 3088.5283 3094.6498 3120.4590 3124.2416 3125.3844 3127.2221 3134.0015 3142.5540 3149.8087 3158.1008 3165.6925
redmass: 4.2572 4.1634 5.1783 8.1334 3.1807 4.8849 5.5164 5.1824 3.1358 3.1999 3.8461 2.3063 4.0557 2.2844 2.3105 5.0956 6.1216 3.1676 4.6625 5.8072 3.7758 3.7640 4.2467 5.8888 3.8079 5.2223 5.3266 3.7764 4.2305 5.0450 3.5545 4.3430 5.2476 4.6805 4.9579 5.1820 3.7564 4.0484 3.9346 5.0436 3.2868 2.3227 1.4727 5.4360 1.5187 4.2768 2.2783 1.4898 3.2814 3.6729 2.3107 2.9242 3.9846 1.4896 2.6464 1.5098 1.4264 4.0567 1.4287 1.4337 2.6831 3.7569 2.2144 2.3212 2.5800 2.3466 2.1605 2.3693 1.8607 1.6662 1.2541 1.3818 1.4509 1.2857 2.2344 1.6633 1.5776 1.9238 1.1173 1.3242 1.9686 2.1672 2.7214 1.5963 1.3172 1.8616 2.1117 4.1919 1.2316 2.6348 5.0648 1.7315 1.7340 2.8888 1.0944 1.0596 3.8016 1.1221 1.0523 6.3988 3.5915 5.4565 9.3580 6.7770 6.6561 7.7824 8.2403 7.5310 1.0363 1.0638 1.0606 1.0594 1.0839 1.1018 1.0980 1.0976 1.1031 1.1060 1.0863 1.0865 1.0885 1.0917 1.0914 1.0983 1.0990 1.0946
irintensity: 0.5639 0.4753 0.4923 1.8315 1.0703 0.4261 2.3333 0.8108 2.8800 2.7847 5.7377 1.9638 10.1544 0.6798 0.2068 0.2361 1.0798 7.0906 5.5688 7.9295 7.5677 3.6864 1.5520 5.3659 2.7817 3.6644 2.7598 1.1324 0.4871 1.2298 0.8108 7.0414 1.2736 1.6289 2.3693 0.8059 8.4973 10.1378 12.4080 5.0362 5.3954 32.3025 0.1963 1.6596 7.1986 5.8711 2.5476 1.7268 7.6036 22.8601 62.3564 24.0154 10.4690 1.4444 11.6223 28.4824 3.7236 0.3581 3.8434 0.0875 43.8936 13.0931 21.2559 76.0658 202.9247 29.2152 50.5579 13.6648 38.1143 13.9896 27.0942 14.4304 32.6455 22.6945 9.8217 41.7184 10.4475 4.6258 2.7254 25.1091 44.3256 49.7279 0.9122 19.6763 6.4284 56.3499 18.3466 12.4116 18.0309 6.2479 2.3221 16.6874 13.0463 2.5962 15.4573 18.4672 16.2839 15.2217 18.8929 15.0276 2.3385 46.0129 103.2936 24.0109 3.4674 54.9923 121.7410 3.0303 15.8732 25.3727 14.3374 39.1364 9.4545 34.5186 19.9546 43.6280 1.7926 26.7685 0.8323 1.0259 6.8737 17.7384 3.8208 27.5846 43.8573 8.3246
temp: 298.150 k
press: 1.00000 atm
elementType: 8 8 8 6 6 6 6 6 6 6 6 6 6 6 6 6 6 6 6 6 6 6 6 6 6 6 1 1 1 1 1 1 1 1 1 1 1 1 1 1 1 1 1 1
symmnumber: 1
zpe: 908731.9 jmol-1
zpe.correction: 0.346118 hartree
zpe.thermalcorrener: 0.366748 hartree
zpe.thermalcorrenthalpy: 0.367692 hartree
zpe.thermalcorrgfe: 0.295757 hartree
zpe.sumelectzpe: -1111.195196 hartree
zpe.sumelectthermal: -1111.174565 hartree
zpe.sumelectthermalent: -1111.173621 hartree
zpe.sumelectthermalfe: -1111.245556 hartree
dipole: 1.3139 5.0640 -1.5815
dipole: 5.4655
quadrupole: -130.2596 -147.6291 -153.6438
quadrupole: -13.6192 8.8715 1.7486
quadrupole: 13.5845 -3.7849 -9.7996 -13.6192 8.8715 1.7486
hfenergy: -1111.5413132 hartree
pointgroup: C01 [X(C23H18O3)]
dipole: 0.2180375 -2.0329647 0.6657378 debye
polarizability: 382.0714227|-59.0633019|317.3967664|-19.9522361|-31.9302912|143.5589971 unknown
InChI: InChI=1S/C23H18O3/c1-2-26-23(25)17-10-11-19(24)18-12-15-7-6-13-4-3-5-14-8-9-16(22(17)18)21(15)20(13)14/h3-9,12,17H,2,10-11H2,1H3
charge 0 multiplicity 1
44 atoms
O  -3.552643 -1.88876 0.373087
O  -1.962029 4.204049 -0.427554
O  -3.643075 -0.185445 -1.218945
C  -2.593976 0.232878 1.002408
C  -1.213091 0.696922 0.525857
C  -3.492366 1.430038 1.426561
C  -0.096256 -0.199869 0.554906
C  -1.026886 2.029633 0.052785
C  1.205132 0.261202 0.124966
C  -3.547755 2.530529 0.35002
C  1.372172 1.61804 -0.340867
C  2.340669 -0.619994 0.155434
C  -2.158116 3.016624 -0.032962
C  0.249925 2.472142 -0.3688
C  -0.212684 -1.576578 1.000984
C  2.191916 -1.978417 0.615342
C  -3.299461 -0.591732 -0.085582
C  3.63726 -0.15083 -0.274625
C  2.68196 2.064254 -0.769433
C  0.8816 -2.421989 1.032326
C  3.770895 1.215035 -0.736851
C  3.325494 -2.835454 0.641347
C  4.744414 -1.039901 -0.233444
C  4.587908 -2.367499 0.220809
C  -4.23002 -2.819472 -0.589125
C  -3.20435 -3.48809 -1.507766
H  -2.479162 -0.431713 1.875074
H  -3.075739 1.846731 2.363833
H  -4.511215 1.067332 1.657136
H  -4.142578 3.399446 0.680336
H  -4.021855 2.130829 -0.568061
H  0.337807 3.505742 -0.721697
H  -1.1899 -1.962171 1.304373
H  2.787578 3.096848 -1.120678
H  0.767009 -3.456905 1.376006
H  4.758791 1.561528 -1.06169
H  3.208957 -3.867622 0.99143
H  5.728303 -0.683381 -0.559751
H  5.453166 -3.038672 0.245737
H  -4.737139 -3.543098 0.068739
H  -4.972177 -2.241549 -1.167258
H  -3.712038 -4.230145 -2.151515
H  -2.716711 -2.744347 -2.159687
H  -2.429231 -4.01177 -0.922007
