program: Gaussian 09
title: 000186339
version: EM64L-G09RevD.01
frameworkgroup: C1[X(C9H9NO7S)]
method: RPBEPBE
basis: SDD
operation: Freq
keyword: #p
keyword: freq=noraman
keyword: PBEPBE/SDD
title: #p freq=noraman PBEPBE/SDD
converged: YES YES NO NO
title: Mulliken charges:
elementType: S O O O O O O O N C C C C C C C C C H H H H H H H H H
charge: 1.122463 -0.401885 -0.272701 -0.551870 -0.448170 -0.480077 -0.448435 -0.209595 -0.415551 0.315104 -0.443854 0.286850 -0.349990 0.185853 -0.330446 -0.178574 -0.387961 0.185251 0.263278 0.286828 0.269696 0.248086 0.382199 0.284690 0.283830 0.403612 0.401369
chargesum: 0.00000
title: Mulliken charges with hydrogens summed into heavy atoms:
elementType: S O O O O O O O N C C C C C C C C C
charge: 1.122463 -0.401885 -0.272701 -0.148258 -0.046801 -0.480077 -0.448435 -0.209595 -0.033352 0.315104 -0.180576 0.286850 -0.063162 0.185853 -0.060751 0.069513 0.180559 0.185251
polarizability: 2.44888619e+02 -5.05835126e+01 2.33067539e+02 -4.40169082e+00 -3.95465156e+00 9.41392414e+01
1716.lowfreq: -0.8937 0.0011 0.0013 0.0014 4.8313 6.1507 19.2107 22.8336 31.1135
frequency: 19.1472 22.8311 31.0840 39.2286 55.4618 62.8971 72.9808 111.0942 120.4139 151.1441 165.5831 191.4725 224.4606 252.0641 262.8375 293.9794 305.0070 310.4224 326.5968 383.9627 396.7539 428.8663 458.4636 496.1706 514.2876 523.2114 545.2482 558.9751 588.4863 628.6293 652.9336 656.1756 676.5278 733.6236 780.4528 819.7917 844.9089 849.2448 903.3961 935.9854 949.9198 953.4180 978.7204 982.8976 1003.9788 1058.0860 1072.6475 1091.4981 1096.1692 1142.1521 1168.1926 1208.5179 1213.5501 1264.7743 1295.3445 1305.7550 1335.2717 1377.4863 1407.2445 1453.3124 1458.8974 1496.1441 1553.5183 1575.4948 1595.8951 1688.1796 2994.1081 3035.0100 3149.9902 3158.9876 3165.2549 3179.2672 3443.7697 3536.9936 3539.2910
redmass: 7.3799 8.2571 10.6263 9.2784 7.2621 9.1403 6.7472 5.7632 4.1448 5.9233 7.0740 5.3431 3.7903 7.6603 4.3662 3.5950 3.8941 8.1876 2.4785 11.4617 6.2390 4.6389 4.9455 1.9267 8.8328 5.3260 4.3007 9.1686 6.1209 1.1528 1.4481 6.4979 1.9052 5.9927 7.2552 1.4403 9.9975 5.1975 1.8057 3.9681 1.6339 6.5460 2.0427 6.0191 1.3846 2.6240 2.0553 1.7338 1.2201 2.2673 1.2951 2.9474 1.0852 1.9723 1.3821 2.3286 1.7236 5.1029 3.9651 1.9840 1.1673 2.2092 6.0404 6.0848 7.3929 9.4830 1.0611 1.0987 1.0875 1.0922 1.0926 1.0995 1.0653 1.0778 1.0654
irintensity: 2.4072 0.6953 2.3095 4.3481 6.1314 1.3350 4.8167 10.4104 6.9914 17.4981 8.6355 4.5228 2.8189 0.3352 67.9666 10.1568 50.8810 14.5757 39.7015 20.4637 24.3225 17.3228 2.3260 35.5229 68.5786 19.4177 69.6018 66.4072 21.9235 5.0610 222.0307 8.2387 39.5558 25.0411 2.4206 30.7498 87.4139 53.0709 25.2712 8.5409 10.9317 65.8018 0.8130 6.2936 0.9430 22.5510 124.4734 24.6244 156.6657 14.3361 22.4545 53.9935 0.0458 27.2902 4.3593 46.0717 13.0657 3.4577 3.2580 71.8924 27.9170 358.3615 1.6673 13.1447 166.6068 298.3025 20.6441 3.6353 6.5327 1.0920 0.7078 8.4304 90.4010 27.7836 55.2356
temp: 298.150 k
press: 1.00000 atm
elementType: 16 8 8 8 8 8 8 8 7 6 6 6 6 6 6 6 6 6 1 1 1 1 1 1 1 1 1
symmnumber: 1
zpe: 468484.8 jmol-1
zpe.correction: 0.178436 hartree
zpe.thermalcorrener: 0.197434 hartree
zpe.thermalcorrenthalpy: 0.198378 hartree
zpe.thermalcorrgfe: 0.127202 hartree
zpe.sumelectzpe: -1326.228332 hartree
zpe.sumelectthermal: -1326.209334 hartree
zpe.sumelectthermalent: -1326.208390 hartree
zpe.sumelectthermalfe: -1326.279566 hartree
dipole: 0.0210 1.9350 1.1624
dipole: 2.2574
quadrupole: -140.0749 -107.1635 -109.8615
quadrupole: 18.1549 6.9291 -5.8687
quadrupole: -21.0416 11.8698 9.1718 18.1549 6.9291 -5.8687
hfenergy: -1326.4067683 hartree
pointgroup: C01 [X(C9H9N1O7S1)]
dipole: 0.0857166 0.6759529 0.569646 debye
polarizability: 238.4559503|-46.9263625|232.3700679|-28.5658674|24.4106638|101.2693805 unknown
InChI: InChI=1S/C9H8NO4.HO3S/c11-7-3-1-2-6(4-7)9(14)10-5-8(12)13;1-4(2)3/h1-4,10,12H,5H2;1H
charge 0 multiplicity 1
27 atoms
S  3.179187 -1.630348 -0.926058
O  3.026709 -0.103036 0.523398
O  -2.608628 2.155341 0.715432
O  3.944103 -2.650724 0.381766
O  -2.718161 -2.562751 -0.336649
O  1.672235 -2.130094 -1.236761
O  4.240635 -1.530452 -2.131138
O  -5.003106 -2.431639 0.098888
N  -2.193492 -0.074225 0.23035
C  -0.304495 1.497052 0.306593
C  0.680041 0.501727 0.460876
C  2.061693 0.843219 0.319208
C  0.091721 2.839558 0.048345
C  -1.783682 1.225822 0.438053
C  2.44786 2.182876 0.001844
C  1.458486 3.177065 -0.10135
C  -3.608992 -0.424185 0.354878
C  -3.886406 -1.884184 0.041084
H  0.43175 -0.536096 0.706097
H  -0.694473 3.597911 -0.02825
H  3.512114 2.406124 -0.122936
H  1.743389 4.213334 -0.308129
H  -1.561554 -0.804154 -0.107791
H  -4.232001 0.198471 -0.317436
H  -3.980282 -0.211355 1.375647
H  3.807517 -2.117507 1.221796
H  -2.916368 -3.512654 -0.552458
