program: Gaussian 09
title: 000186362
version: EM64L-G09RevD.01
frameworkgroup: C1[X(C22H19NOS)]
method: RPBEPBE
basis: SDD
operation: Freq
keyword: #p
keyword: freq=noraman
keyword: PBEPBE/SDD
title: #p freq=noraman PBEPBE/SDD
converged: YES YES NO NO
title: Mulliken charges:
elementType: S O N C C C C C C C C C C C C C C C C C C C C C C H H H H H H H H H H H H H H H H H H H
charge: -0.044897 -0.238173 -0.031834 -0.006186 0.283379 -0.014327 0.290478 -0.536215 0.482505 -0.357257 -0.382007 0.490271 0.471310 -0.295911 -0.455113 -0.400732 -0.302149 -0.302467 -0.518904 -0.514857 -0.485404 -0.487108 -0.469072 -0.463852 -0.243458 0.291109 0.216711 0.257945 0.231384 0.237140 0.254472 0.228346 0.262027 0.228147 0.204957 0.214942 0.226838 0.244678 0.236955 0.241722 0.238877 0.244392 0.242628 0.228710
chargesum: 0.00000
title: Mulliken charges with hydrogens summed into heavy atoms:
elementType: S O N C C C C C C C C C C C C C C C C C C C C C C
charge: -0.044897 -0.238173 -0.031834 -0.006186 0.283379 -0.014327 0.290478 -0.028395 0.482505 0.132072 0.109605 0.490271 0.471310 -0.295911 -0.226767 -0.138705 0.130954 0.139313 -0.274226 -0.277902 -0.243682 -0.248231 -0.224680 -0.221224 -0.014748
polarizability: 4.07842521e+02 -8.73232325e+00 2.40448081e+02 -6.13837665e+01 -2.85368523e+01 2.04075819e+02
1716.lowfreq: -12.4298 -9.9350 -7.1658 -0.0009 -0.0007 -0.0002 5.2369 23.4064 50.3514
frequency: -8.8135 23.3503 50.1903 55.8403 71.0929 98.9564 124.0034 158.5417 173.9272 196.1272 215.7984 262.7847 278.7067 285.0278 307.4937 334.0739 359.1248 397.8320 401.6286 410.9165 415.9996 440.5317 452.2310 474.2839 485.9496 495.3909 508.5035 512.2550 525.7810 546.3272 555.6800 575.9173 593.1143 624.6767 688.0833 690.6454 696.2131 722.5133 742.6023 759.6520 768.9226 797.4664 808.5344 814.1792 828.8561 830.8315 839.9004 860.0839 867.0399 877.4499 902.8792 915.5350 944.5848 969.3044 970.8531 976.7597 985.3827 991.5849 1008.7377 1024.6356 1041.5413 1045.2755 1069.3722 1090.1413 1104.3391 1110.5526 1117.0147 1155.7600 1164.6473 1174.7835 1183.6755 1190.5284 1193.9406 1211.4615 1229.1934 1243.3788 1248.4270 1253.8454 1258.6145 1268.9716 1278.7898 1291.7197 1326.6791 1332.3075 1340.0096 1347.6417 1368.1445 1376.3984 1390.1071 1407.5853 1425.5160 1430.9289 1436.5410 1437.5931 1445.0895 1449.3970 1457.3050 1462.6988 1464.9860 1474.2551 1494.0609 1512.6789 1548.2116 1593.5980 1604.0228 1610.6161 1635.9501 2961.0490 2963.8008 2986.5054 2989.7277 2992.3727 3055.3081 3062.2481 3087.4170 3091.9360 3117.6368 3121.1329 3122.6692 3123.7655 3124.9864 3133.4256 3143.3131 3146.4292 3153.9438 3158.1835
redmass: 5.8399 5.8747 4.2372 4.6570 6.2281 4.6711 4.4059 7.1472 3.6176 3.3981 3.8953 4.5702 3.2094 3.3217 3.4068 2.9334 5.0658 2.3390 4.2331 4.1022 3.5195 2.9912 6.3737 3.9411 4.5729 3.6029 5.1328 3.8218 4.7798 3.0414 3.8309 5.2836 3.4800 3.0625 6.8283 4.1191 3.8854 3.2740 2.9774 5.5014 1.2796 4.3241 4.2912 1.4320 1.6878 2.0628 2.9527 3.1305 4.6411 1.7463 2.5022 1.4567 2.1519 4.2522 1.3668 1.4418 1.3978 1.4174 2.4691 2.4242 3.2646 2.5029 3.5017 2.0506 2.2385 2.4461 3.2878 1.3630 1.5989 1.4150 1.5197 1.0858 1.2938 1.8838 1.9232 1.9517 1.5301 1.3383 2.2191 1.4094 1.3128 1.5416 1.2557 2.9824 1.2333 1.3377 1.2650 3.5823 2.5713 2.6059 4.0931 5.5950 2.1087 1.6220 1.0788 1.0811 1.1024 1.8951 1.7460 1.7602 4.8316 3.7958 4.9114 6.7032 6.9572 6.4067 7.5043 1.0677 1.0677 1.0630 1.0643 1.0625 1.0965 1.1018 1.0972 1.0984 1.0940 1.0865 1.0871 1.0867 1.0864 1.0918 1.0970 1.0980 1.0956 1.0989
irintensity: 0.2164 0.1999 0.8371 2.2640 2.5241 0.3559 0.0962 0.1365 1.9791 4.3710 10.9979 0.0205 6.8633 6.5708 3.9389 4.5769 0.2772 1.5139 1.8570 2.6354 0.1659 0.9068 1.4947 0.4149 3.5119 1.7626 6.1486 0.9590 3.4903 1.0805 6.7473 3.4084 3.5390 3.0183 0.0470 2.9304 1.4575 29.5777 5.7022 0.4738 11.7576 17.1706 7.0971 0.5725 0.5637 4.3819 5.3841 0.1300 3.9875 138.0416 1.3834 2.7209 27.1284 0.3804 4.4910 4.3084 5.8265 0.2329 8.9923 41.9648 24.8829 28.7188 32.7827 7.4181 21.6396 3.4326 14.5516 1.1509 40.3225 5.2191 1.6682 2.2146 23.0939 10.8088 2.6278 14.2232 11.7125 23.6612 0.0815 64.4103 38.4878 17.7159 2.5979 0.5106 0.5872 3.0635 0.7492 8.3943 1.2639 2.5844 1.0015 1.1358 7.9152 118.5972 4.6934 0.9706 6.0124 18.4334 8.7456 93.9808 3.7530 15.5785 0.1475 9.1687 1.6898 7.2320 0.1689 39.0813 36.7656 5.7707 80.4041 30.4366 4.5225 13.1829 23.2447 39.7356 6.6900 1.3148 2.9814 1.7157 1.9320 14.4737 7.0447 42.0649 26.4599 40.9829
temp: 298.150 k
press: 1.00000 atm
elementType: 16 8 7 6 6 6 6 6 6 6 6 6 6 6 6 6 6 6 6 6 6 6 6 6 6 1 1 1 1 1 1 1 1 1 1 1 1 1 1 1 1 1 1 1
symmnumber: 1
zpe: 924291.3 jmol-1
zpe.correction: 0.352044 hartree
zpe.thermalcorrener: 0.370773 hartree
zpe.thermalcorrenthalpy: 0.371717 hartree
zpe.thermalcorrgfe: 0.304920 hartree
zpe.sumelectzpe: -1376.074835 hartree
zpe.sumelectthermal: -1376.056106 hartree
zpe.sumelectthermalent: -1376.055162 hartree
zpe.sumelectthermalfe: -1376.121959 hartree
dipole: -2.6372 0.7143 2.8569
dipole: 3.9531
quadrupole: -148.1822 -146.5509 -162.0914
quadrupole: 2.9056 4.9004 -16.3240
quadrupole: 4.0927 5.7239 -9.8165 2.9056 4.9004 -16.3240
hfenergy: -1376.426879 hartree
pointgroup: C01 [X(C22H19N1O1S1)]
dipole: -0.6877842 1.3670578 -0.2775235 debye
polarizability: 356.2355815|-102.979688|264.8836269|5.1861223|40.6759345|231.2472125 unknown
InChI: InChI=1S/C22H19NOS/c25-20(23-10-12-24-13-11-23)14-18-7-6-17-5-4-15-2-1-3-16-8-9-19(18)22(17)21(15)16/h1-9H,10-14H2
charge 0 multiplicity 1
44 atoms
S  3.976487 -3.112077 1.135203
O  4.32939 0.687833 -2.523626
N  3.884679 -0.612536 0.028266
C  -1.423149 -0.014831 0.356921
C  -0.234948 -0.075909 1.183137
C  -2.485857 0.902955 0.673281
C  0.816803 -0.986142 0.836025
C  2.094945 -1.097088 1.67805
C  -1.552957 -0.878799 -0.791331
C  5.101583 -0.901231 -0.771761
C  3.354427 0.751687 -0.232965
C  -2.381514 1.767832 1.822627
C  -3.666338 0.964815 -0.156911
C  3.338354 -1.528412 0.89596
C  -0.172525 0.798016 2.339901
C  0.654975 -1.832073 -0.288864
C  4.811461 -0.682108 -2.268002
C  3.107515 0.938497 -1.747485
C  -0.502614 -1.78615 -1.087272
C  -1.195802 1.678244 2.643636
C  -2.747127 -0.801308 -1.60482
C  -3.763048 0.0860 -1.302475
C  -3.438673 2.670575 2.11857
C  -4.700017 1.882824 0.173279
C  -4.585196 2.726531 1.29859
H  1.949819 -1.857028 2.46533
H  2.306451 -0.14228 2.196343
H  5.40499 -1.942799 -0.566875
H  5.907511 -0.215865 -0.443471
H  4.10553 1.491504 0.109294
H  2.413614 0.919277 0.309585
H  0.697337 0.750172 3.002441
H  1.450692 -2.546985 -0.526655
H  5.733122 -0.786926 -2.862613
H  4.057435 -1.418646 -2.618927
H  2.295171 0.257054 -2.078461
H  2.824647 1.981251 -1.965185
H  -0.600949 -2.45714 -1.948644
H  -1.122795 2.324214 3.526662
H  -2.828928 -1.46619 -2.472593
H  -4.663057 0.137772 -1.926249
H  -3.354912 3.324272 2.994551
H  -5.594689 1.928846 -0.458568
H  -5.39234 3.427149 1.538098
