program: Gaussian 09
title: 000186329
version: EM64L-G09RevD.01
frameworkgroup: C1[X(C16H14O)]
method: RPBEPBE
basis: SDD
operation: Freq
keyword: #pfreq=noraman
keyword: PBEPBE/SDD
title: #p freq=noraman PBEPBE/SDD
converged: NO YES NO NO
title: Mulliken charges:
elementType: O C C C C C C C C C C C C C C C C H H H H H H H H H H H H H H
charge: -0.447337 -0.337844 -0.296152 0.428463 0.386285 -0.149682 -0.231371 -0.498992 -0.221809 -0.168503 0.512427 -0.463794 -0.470890 -0.454637 -0.452297 -0.222956 -0.222769 0.227302 0.227895 0.203201 0.217013 0.218177 0.255145 0.224845 0.255901 0.240128 0.235717 0.236149 0.218025 0.218294 0.334064
chargesum: 0.00000
title: Mulliken charges with hydrogens summed into heavy atoms:
elementType: O C C C C C C C C C C C C C C C C
charge: -0.113273 -0.110542 -0.068257 0.428463 0.386285 0.053519 -0.231371 -0.063802 0.033336 0.056342 0.512427 -0.207893 -0.230763 -0.218920 -0.216148 -0.004931 -0.004474
polarizability: 1.88297819e+02 1.26618382e+01 2.03851063e+02 -1.66368464e+01 6.50969481e+00 1.02537638e+02
1716.lowfreq: -15.0231 -7.7902 0.0006 0.0007 0.0007 10.9069 34.6866 85.0941 141.7556
frequency: 34.1514 85.0751 141.7452 162.8849 180.3727 234.8873 272.8197 291.6342 306.3564 376.6765 383.9780 402.9127 452.8846 465.8153 469.1382 507.7181 530.4327 549.7879 574.4879 588.5656 642.4457 655.5078 659.2413 721.2641 754.9550 762.2130 788.4566 795.2773 840.4464 849.3605 864.9798 899.6273 906.5033 916.7710 937.9985 954.1517 964.4748 972.6548 982.2746 994.9635 1019.7270 1031.8870 1041.0020 1055.6781 1067.0205 1116.0557 1148.5658 1172.0423 1172.6700 1183.2326 1194.0559 1203.9700 1212.3435 1223.5173 1241.2258 1246.3321 1254.4916 1281.9169 1311.5687 1335.7733 1343.7646 1372.5661 1393.4786 1410.7416 1415.0560 1461.1963 1466.5717 1468.8163 1504.1540 1600.4900 1607.9218 1630.4208 1653.6406 2896.4208 2950.8900 2960.2605 3002.8892 3049.0580 3117.3066 3120.4852 3129.5215 3132.8462 3143.3177 3151.2363 3168.6114 3169.6235 3562.3526
redmass: 4.4496 4.1187 5.5360 3.7988 3.0283 3.9956 4.0360 1.7963 1.6773 4.1594 3.0824 4.1005 4.1054 3.4185 3.6226 5.2039 5.5540 4.9839 3.8077 3.0613 3.2104 4.6269 2.3533 2.7912 3.1862 1.3794 1.6743 5.1482 2.7379 3.0487 2.4718 2.4509 1.7441 1.5811 2.0890 1.7690 2.6572 1.3573 1.3740 3.0125 2.9682 3.3608 2.6133 2.1931 2.2132 2.0392 1.0816 1.1982 1.2062 1.2810 1.1460 1.1454 1.4643 1.2963 1.6913 1.8730 1.5845 1.7499 1.3282 1.4038 1.5179 2.8506 4.7556 1.7953 1.8443 1.1883 2.4216 7.5121 4.7322 6.6727 7.8256 7.8910 7.0496 1.0820 1.0687 1.0835 1.0853 1.0925 1.0858 1.0861 1.0916 1.0870 1.0950 1.0983 1.1015 1.0953 1.0660
irintensity: 0.4066 1.1855 5.1981 2.1515 2.3910 0.7105 3.1592 68.8454 122.9994 2.4105 18.6118 3.4968 1.1209 0.6733 0.2934 0.8372 1.4959 0.4729 2.6078 3.7738 0.4295 3.4315 20.2675 30.0859 4.0196 0.1336 94.9029 0.1981 41.5222 10.5602 2.1335 5.0561 1.3686 2.0445 2.0233 1.4070 11.3519 0.5250 3.9340 3.5934 54.0402 21.4327 10.6932 1.1803 2.9428 9.8193 3.9901 4.9646 4.9832 3.7345 10.6065 12.4788 2.6496 13.9401 3.0323 18.3731 0.6928 3.0983 2.6203 4.2323 5.2867 23.0997 0.7166 1.6824 0.1566 10.4455 4.7914 0.1349 4.5862 15.9874 9.7576 8.8826 3.8260 67.0321 39.0124 30.0288 54.8314 19.9199 2.4340 3.3457 18.9530 8.2549 35.4982 41.9156 15.3319 13.1212 6.4663
temp: 298.150 k
press: 1.00000 atm
elementType: 8 6 6 6 6 6 6 6 6 6 6 6 6 6 6 6 6 1 1 1 1 1 1 1 1 1 1 1 1 1 1
symmnumber: 1
zpe: 659576.6 jmol-1
zpe.correction: 0.251219 hartree
zpe.thermalcorrener: 0.263957 hartree
zpe.thermalcorrenthalpy: 0.264901 hartree
zpe.thermalcorrgfe: 0.212333 hartree
zpe.sumelectzpe: -692.129097 hartree
zpe.sumelectthermal: -692.116360 hartree
zpe.sumelectthermalent: -692.115415 hartree
zpe.sumelectthermalfe: -692.167983 hartree
dipole: 0.5646 -1.2379 -1.7284
dipole: 2.1996
quadrupole: -94.3620 -90.6065 -98.1781
quadrupole: -1.2303 -9.4111 -1.3337
quadrupole: 0.0202 3.7757 -3.7959 -1.2303 -9.4111 -1.3337
hfenergy: -692.3803162 hartree
pointgroup: C01 [X(C16H14O1)]
dipole: -0.2421414 -0.4431219 0.7028032 debye
polarizability: 184.454204|-11.6268184|205.8734669|-20.1392622|-7.2354988|104.3588487 unknown
InChI: InChI=1S/C16H14O/c17-14-9-3-7-12-11-6-1-4-10-5-2-8-13(15(10)11)16(12)14/h1-6,8-9,12,14,16-17H,7H2
charge 0 multiplicity 1
31 atoms
O  -3.032936 1.94082 0.190916
C  -1.348151 0.252855 1.029236
C  -0.943508 -1.288423 0.977524
C  -0.139186 0.994038 0.443923
C  0.519904 -1.277418 0.528297
C  -2.699909 0.510456 0.288163
C  0.907296 0.054605 0.214832
C  -1.849621 -2.128875 0.004208
C  -2.646965 -0.065253 -1.106001
C  -2.223149 -1.348159 -1.244323
C  2.203459 0.406648 -0.273692
C  0.098056 2.341012 0.158713
C  1.447581 -2.308077 0.367723
C  2.423123 1.797162 -0.553236
C  3.141703 -0.66934 -0.42967
C  1.390359 2.723703 -0.344366
C  2.764312 -1.983169 -0.111843
H  -1.48551 0.558881 2.088014
H  -1.034286 -1.737599 1.985344
H  -3.494241 -0.008059 0.876513
H  -2.77489 -2.416667 0.548308
H  -1.330966 -3.069312 -0.253442
H  -2.933292 0.580462 -1.942108
H  -2.144208 -1.824246 -2.228116
H  -0.681767 3.095979 0.288765
H  1.198303 -3.350532 0.598188
H  3.396494 2.131867 -0.931329
H  4.153843 -0.461805 -0.796901
H  1.569973 3.78167 -0.56992
H  3.493793 -2.792736 -0.232891
H  -3.191216 2.293215 1.103171
