program: Gaussian 09
title: 000186364
version: EM64L-G09RevD.01
frameworkgroup: C1[X(C23H20O4)]
method: RPBEPBE
basis: SDD
operation: Freq
keyword: #pfreq=noraman
keyword: PBEPBE/SDD
title: #p freq=noraman PBEPBE/SDD
converged: YES YES NO NO
title: Mulliken charges:
elementType: O O O O C C C C C C C C C C C C C C C C C C C C C C C H H H H H H H H H H H H H H H H H H H H
charge: -0.262918 -0.239700 -0.416617 -0.227265 -0.325098 0.005321 0.318642 0.298478 -0.021398 0.479549 -0.412413 0.496133 0.473307 -0.425699 -0.462602 -0.531080 -0.522662 -0.485863 -0.470873 0.219115 -0.488342 -0.470587 -0.464994 -0.244176 0.169045 -0.260448 -0.665604 0.235479 0.252730 0.228248 0.268326 0.222669 0.243257 0.235636 0.242393 0.245468 0.277759 0.238466 0.243995 0.241969 0.227894 0.226010 0.235377 0.218624 0.251294 0.226160 0.376994
chargesum: 0.00000
title: Mulliken charges with hydrogens summed into heavy atoms:
elementType: O O O O C C C C C C C C C C C C C C C C C C C C C C C
charge: -0.262918 -0.239700 -0.039623 -0.227265 -0.089619 0.005321 0.318642 0.298478 -0.021398 0.479549 0.068565 0.496133 0.473307 -0.157373 -0.239933 -0.287823 -0.287026 -0.243470 0.052354 0.219115 -0.249875 -0.226592 -0.223026 -0.016281 0.169045 0.200939 0.030475
polarizability: 4.02004735e+02 6.88884042e+00 1.75155681e+02 -3.23829152e+01 6.31434406e+00 2.71288319e+02
1716.lowfreq: -5.4254 -3.4656 -0.0008 -0.0006 -0.0005 2.5667 12.3850 16.3479 19.3296
frequency: 12.0196 16.3291 19.3258 27.1372 40.9713 60.7291 68.8716 87.5607 93.3404 109.6022 137.1340 150.8802 177.4154 194.3999 202.5652 214.6915 240.8419 253.4791 267.5104 309.2313 320.4396 367.8881 389.8321 409.1076 418.0078 438.5612 452.6556 470.7761 499.0677 505.2799 506.5664 509.1605 515.8134 546.7836 553.3298 577.6445 599.9588 629.4328 638.5730 662.4421 687.0038 689.7959 698.8997 728.6996 749.2137 754.0723 768.7764 785.4244 805.3471 809.4457 817.0959 820.2708 843.1813 846.6947 861.4283 867.6154 879.5520 915.7051 934.2248 969.0879 971.9207 977.6421 986.1192 991.8136 994.4814 1012.0958 1025.9770 1044.1774 1076.9110 1085.4883 1095.0355 1095.9852 1112.1493 1118.5303 1153.9236 1156.5314 1160.2173 1178.9101 1188.6929 1194.2757 1229.3607 1233.3384 1244.5487 1249.9529 1259.2242 1268.0767 1277.6629 1287.1211 1307.3995 1324.9730 1332.6528 1355.8369 1373.1127 1382.6032 1390.9189 1391.3831 1407.8523 1425.5351 1431.4352 1436.7462 1438.1024 1456.7537 1463.2119 1465.8284 1471.7566 1484.7613 1494.5199 1513.8747 1549.3608 1594.0312 1603.9179 1611.5205 1632.5456 1636.7884 1668.1657 2992.6024 2993.1305 3013.1238 3030.7153 3040.2462 3066.3528 3087.2466 3088.0140 3094.1772 3120.2619 3121.0211 3123.2752 3126.7131 3127.1402 3132.6698 3145.8296 3150.1259 3157.0674 3161.1818 3512.5315
redmass: 5.8102 11.6301 4.4795 6.1103 3.4286 3.8541 5.3571 2.5193 4.3173 3.9379 5.5115 5.1208 3.8322 1.6740 2.9924 3.8283 6.2410 2.2382 4.5459 4.4128 3.6033 4.9129 4.7683 6.0141 4.5322 3.4934 4.7097 5.4336 3.8809 1.9350 3.6322 5.1655 3.7828 3.7624 4.0458 5.8508 4.4170 3.6226 1.3901 4.5762 5.3536 5.0030 3.4277 2.5976 3.0918 3.6287 1.2971 2.2012 1.7807 3.1527 1.5500 2.0062 2.6211 3.8772 2.9701 4.4247 1.6842 1.4661 3.5662 3.6915 1.3666 1.4762 1.3993 1.5281 2.3248 2.4929 2.9870 3.1911 3.0510 2.2521 2.0806 2.1690 2.4776 2.8861 1.4500 1.6656 1.3909 1.3034 1.4664 1.3185 1.8058 1.6598 1.7066 1.5923 2.2050 1.3527 1.1194 1.4635 1.4581 1.5794 2.7532 1.3194 1.8599 3.4928 1.5855 1.6672 2.6320 3.7589 5.5000 1.1136 2.0736 1.0941 1.0453 4.4776 1.0994 1.0512 4.7397 3.6883 4.9407 6.6191 6.8692 6.3722 8.5742 7.4958 8.2162 1.0606 1.0362 1.0629 1.0596 1.0969 1.0874 1.0967 1.0973 1.1030 1.1063 1.0862 1.0860 1.0877 1.0877 1.0917 1.0983 1.0961 1.0990 1.0944 1.0639
irintensity: 0.0517 0.8287 1.5889 0.2166 0.2445 0.3372 0.7209 0.8412 0.2146 0.3383 1.4631 1.3587 2.4571 1.6363 0.4084 11.4906 1.4190 0.5721 0.0274 7.0485 14.3159 3.3571 2.6514 0.4012 3.9121 1.1353 30.9417 3.0675 2.2776 27.1166 3.5762 4.1511 4.9560 0.7005 8.3435 7.8680 11.3068 8.2881 116.9334 2.3983 2.3168 3.6400 4.7629 35.8615 7.9862 4.4877 12.1053 13.2304 4.6976 5.4033 2.1409 6.7499 2.9315 6.6231 2.3792 0.8145 137.5782 2.8382 10.3994 2.2852 0.2395 0.1790 2.8278 2.6460 48.9589 51.7766 77.2281 71.6045 168.5302 88.5149 38.5659 13.2760 0.1852 177.8649 5.1115 17.4366 2.9511 2.0354 0.5083 16.5476 14.1565 35.1426 9.0542 5.3128 3.5663 32.8320 2.0983 106.1417 2.4908 16.0037 0.5041 3.0532 59.3761 14.7893 14.6148 10.3475 3.5172 0.8303 0.7116 32.2301 5.0568 12.1641 14.9853 4.3260 22.5134 13.3280 2.4843 8.3280 1.3559 5.8224 0.8107 5.2197 124.9962 3.9996 233.4847 9.3015 22.7259 24.2803 25.1644 3.0701 0.2489 24.4555 36.0902 1.3908 27.5596 1.1112 0.2286 6.5083 3.3369 15.8316 31.5158 14.6247 46.6022 22.9490 21.3673
temp: 298.150 k
press: 1.00000 atm
elementType: 8 8 8 8 6 6 6 6 6 6 6 6 6 6 6 6 6 6 6 6 6 6 6 6 6 6 6 1 1 1 1 1 1 1 1 1 1 1 1 1 1 1 1 1 1 1 1
symmnumber: 1
zpe: 972121.8 jmol-1
zpe.correction: 0.370262 hartree
zpe.thermalcorrener: 0.393851 hartree
zpe.thermalcorrenthalpy: 0.394796 hartree
zpe.thermalcorrgfe: 0.312987 hartree
zpe.sumelectzpe: -1187.514257 hartree
zpe.sumelectthermal: -1187.490667 hartree
zpe.sumelectthermalent: -1187.489723 hartree
zpe.sumelectthermalfe: -1187.571531 hartree
dipole: 1.8339 -1.1437 -2.0053
dipole: 2.9483
quadrupole: -151.6943 -148.3796 -145.3020
quadrupole: 9.2011 11.1565 0.2568
quadrupole: -3.2356 0.0790 3.1566 9.2011 11.1565 0.2568
hfenergy: -1187.8845186 hartree
pointgroup: C01 [X(C23H20O4)]
dipole: 0.881524 0.2552331 0.7093832 debye
polarizability: 386.5680808|-64.475269|195.6153988|24.5055059|4.6914976|266.2652554 unknown
InChI: InChI=1S/C23H20O4/c1-2-27-23(26)19(12-13-20(24)25)17-10-8-16-7-6-14-4-3-5-15-9-11-18(17)22(16)21(14)15/h3-11,19,24H,2,12-13H2,1H3
charge 0 multiplicity 1
47 atoms
O  -2.030073 3.152377 0.817983
O  -3.162653 2.37295 -1.06799
O  -3.335867 -3.90105 1.28056
O  -4.849896 -2.566329 0.133917
C  -1.948009 0.783885 0.405374
C  1.675501 -0.279348 -0.651515
C  -0.702273 0.406947 -0.414827
C  0.562285 0.11035 0.19212
C  2.955936 -0.594837 -0.073235
C  1.510548 -0.356517 -2.082713
C  -3.085634 -0.271377 0.276442
C  3.1461 -0.525306 1.354337
C  4.061965 -0.984158 -0.916953
C  -0.832473 0.328691 -1.825161
C  0.796017 0.174903 1.622789
C  0.245841 -0.042791 -2.645821
C  2.026234 -0.128815 2.176196
C  2.63345 -0.747254 -2.906926
C  -2.638128 -1.651813 0.788642
C  -2.462834 2.152252 -0.052102
C  3.860974 -1.049776 -2.348077
C  4.41561 -0.841068 1.909217
C  5.315884 -1.292013 -0.322144
C  5.488945 -1.220869 1.076264
C  -3.731392 -2.69475 0.67755
C  -2.419801 4.557905 0.471528
C  -3.799405 4.893739 1.043895
H  -1.681421 0.892643 1.468017
H  -3.410909 -0.342492 -0.775554
H  -3.9675 0.071276 0.849533
H  -1.796549 0.581922 -2.280228
H  -0.015845 0.482384 2.287768
H  0.115494 -0.091058 -3.733061
H  2.17144 -0.068148 3.261292
H  2.487441 -0.798667 -3.992154
H  -2.310494 -1.610922 1.845474
H  -1.761624 -2.018513 0.219472
H  4.705246 -1.345431 -2.981841
H  4.553523 -0.786041 2.995309
H  6.152956 -1.587352 -0.965538
H  6.462249 -1.46156 1.517313
H  -1.62077 5.164917 0.925984
H  -2.403499 4.662904 -0.627444
H  -4.033884 5.956941 0.849941
H  -4.580987 4.277646 0.568802
H  -3.825342 4.729092 2.134965
H  -4.066676 -4.569967 1.1790
