program: Gaussian 09
title: 000186306
version: EM64L-G09RevD.01
frameworkgroup: C1[X(C18H14O3)]
method: RPBEPBE
basis: SDD
operation: Freq
keyword: #pfreq=noraman
keyword: PBEPBE/SDD
title: #p freq=noraman PBEPBE/SDD
converged: NO YES NO NO
title: Mulliken charges:
elementType: O O O C C C C C C C C C C C C C C C C C C H H H H H H H H H H H H H H
charge: -0.437594 -0.444673 -0.406229 -0.185909 0.172588 0.140563 -0.316343 0.256258 0.279998 -0.507068 0.242678 -0.418618 0.154367 -0.431520 -0.429283 0.435630 -0.515391 -0.347703 -0.440226 -0.259178 -0.251867 0.256632 0.286185 0.217022 0.278797 0.226511 0.215109 0.234349 0.222801 0.358263 0.241944 0.355644 0.228648 0.357194 0.230423
chargesum: 0.00000
title: Mulliken charges with hydrogens summed into heavy atoms:
elementType: O O O C C C C C C C C C C C C C C C C C C
charge: -0.079331 -0.089029 -0.049036 0.070723 0.172588 0.140563 -0.030157 0.256258 0.279998 -0.290046 0.242678 -0.139821 0.154367 -0.205009 -0.214174 0.435630 -0.281042 -0.124902 -0.198282 -0.030530 -0.021444
polarizability: 3.72153828e+02 9.04616267e+00 2.15801606e+02 -9.25329600e+00 3.26144228e-01 9.51890524e+01
1716.lowfreq: -8.0218 -0.0007 -0.0004 -0.0003 3.7038 7.5237 43.1785 52.8569 88.5057
frequency: 43.1619 52.8495 88.5049 109.7159 135.8126 150.8837 212.4645 217.0185 242.8043 250.1901 273.6641 305.4231 316.3170 333.7874 347.9113 403.1958 412.0050 440.0574 444.2274 472.0107 493.0022 502.0192 516.9892 536.9383 541.3716 560.6179 578.4467 583.6665 618.6888 636.0975 668.4447 719.0797 729.8880 752.4567 763.0387 772.7273 799.0539 830.3110 836.3218 847.4511 861.1708 866.2966 886.8550 890.9150 925.2803 951.7736 955.3881 976.3262 984.9992 992.4154 1010.7750 1037.3012 1050.1024 1068.0793 1116.9162 1138.8156 1172.8719 1177.3924 1180.9432 1204.3745 1214.3724 1225.6708 1235.3446 1247.0461 1251.9389 1260.3014 1274.6950 1305.1111 1325.6478 1357.7670 1365.7457 1374.3853 1387.5080 1404.8906 1419.2302 1422.2689 1447.1466 1455.4451 1500.5335 1536.6469 1576.2060 1588.3433 1615.3825 1625.7375 1635.7055 2994.4371 3098.7236 3122.2158 3124.1253 3129.9194 3134.1875 3145.1272 3153.2630 3161.1056 3164.9289 3170.7355 3463.3282 3534.0557 3547.9128
redmass: 5.5088 5.1252 5.3468 4.0272 5.7531 5.9441 3.9235 4.5411 5.5953 5.7483 4.8629 4.5059 3.3039 5.2564 1.2838 4.4557 3.6988 3.3914 1.3203 5.0069 3.3024 5.4943 3.9715 3.2605 1.3948 6.9560 3.0909 3.8967 4.3641 4.7254 5.3489 2.7982 5.7052 2.7543 1.5939 3.7705 1.9222 2.5062 1.6048 2.4381 2.2790 3.7314 2.9886 2.4339 4.1922 4.5140 1.3881 1.4006 1.3922 1.3533 3.6613 2.2918 2.9454 3.1570 1.7833 1.5079 1.2471 1.1642 1.1829 1.9422 1.3892 1.4010 2.0420 1.6229 1.7884 1.8163 1.8389 1.9022 2.2815 1.3956 1.3375 2.2564 3.9249 5.8926 2.3684 2.2543 3.8003 2.3978 3.3534 4.4433 7.6909 6.6120 6.3479 6.6113 7.7241 1.0831 1.0872 1.0870 1.0874 1.0902 1.0885 1.0890 1.0925 1.0939 1.0992 1.0955 1.0646 1.0660 1.0656
irintensity: 0.1641 0.9876 2.1122 0.4724 0.7535 2.3941 4.8211 1.8627 1.7412 5.2351 3.9371 1.0357 2.3862 12.6231 41.5461 6.7655 2.3473 19.4301 134.4496 2.8315 1.0398 1.4042 2.2469 28.0286 105.2539 0.0598 7.4934 13.4516 13.3403 0.6841 31.7305 3.8084 25.2249 1.8917 47.5118 73.3302 9.0117 3.0924 93.0351 1.6216 1.7576 8.5518 21.2695 38.7646 35.4923 13.0715 4.0128 2.9282 1.0153 0.7672 89.7959 14.0128 73.0341 13.4478 292.7659 5.5163 1.3474 7.7139 46.5541 4.8685 5.0064 26.3059 4.3304 20.1679 2.4137 28.4345 4.2997 14.0335 4.4242 57.7626 18.7947 28.3218 8.9952 1.7937 7.6743 4.5569 9.0458 31.9707 5.9082 1.8403 33.3400 8.8819 3.3482 19.1723 152.1877 13.8197 14.0445 0.5112 14.5194 12.4591 7.8713 4.0308 24.5304 36.5328 13.1785 29.9826 29.4534 9.9639 53.4316
temp: 298.150 k
press: 1.00000 atm
elementType: 8 8 8 6 6 6 6 6 6 6 6 6 6 6 6 6 6 6 6 6 6 1 1 1 1 1 1 1 1 1 1 1 1 1 1
symmnumber: 1
zpe: 711686.8 jmol-1
zpe.correction: 0.271067 hartree
zpe.thermalcorrener: 0.287524 hartree
zpe.thermalcorrenthalpy: 0.288468 hartree
zpe.thermalcorrgfe: 0.227763 hartree
zpe.sumelectzpe: -918.538600 hartree
zpe.sumelectthermal: -918.522143 hartree
zpe.sumelectthermalent: -918.521199 hartree
zpe.sumelectthermalfe: -918.581904 hartree
dipole: -2.5994 3.1211 -0.0043
dipole: 4.0618
quadrupole: -125.7121 -106.3101 -126.3824
quadrupole: 9.9755 -4.2509 -3.0469
quadrupole: -6.2439 13.1581 -6.9142 9.9755 -4.2509 -3.0469
hfenergy: -918.8096669 hartree
pointgroup: C01 [X(C18H14O3)]
dipole: -1.0237093 1.22691 0.0207478 debye
polarizability: 371.9463092|9.310088|215.7987249|-11.6769524|1.5209236|95.3994525 unknown
InChI: InChI=1S/C18H14O3/c19-16-9-15-13-6-5-10-3-1-2-4-11(10)12(13)7-8-14(15)17(20)18(16)21/h1-9,17-21H
charge 0 multiplicity 1
35 atoms
O  3.693803 -2.460404 -0.208105
O  4.124563 -0.350207 1.533827
O  4.464235 2.320313 -0.23182
C  3.221633 -1.141143 -0.627638
C  1.721831 -0.940757 -0.38869
C  1.197454 0.374836 -0.302846
C  4.06529 -0.051901 0.072743
C  -0.228891 0.568036 -0.169283
C  -1.106778 -0.581189 -0.127572
C  2.141424 1.507267 -0.355305
C  3.490897 1.316087 -0.203307
C  0.855833 -2.05799 -0.329634
C  -2.556412 -0.384794 -0.004748
C  -0.528626 -1.883122 -0.202202
C  -0.810092 1.889236 -0.062307
C  -3.083349 0.954318 0.0868
C  -2.17382 2.074411 0.059642
C  -3.487027 -1.469408 0.028045
C  -4.492283 1.161954 0.205869
C  -4.866249 -1.246701 0.144852
C  -5.378279 0.079368 0.235124
H  3.419951 -1.093339 -1.716971
H  5.115683 -0.117057 -0.248871
H  1.75586 2.522431 -0.503473
H  1.29664 -3.057789 -0.391096
H  -1.165734 -2.770794 -0.161408
H  -0.159881 2.76873 -0.066109
H  -2.588927 3.086107 0.140461
H  -3.130113 -2.501117 -0.040779
H  3.888615 -2.380175 0.766936
H  -4.869666 2.189279 0.273572
H  3.26781 -0.064037 1.947647
H  -5.554516 -2.098778 0.166001
H  4.057738 3.215231 -0.363135
H  -6.456917 0.246398 0.32588
