program: Gaussian 09
title: 000186292
version: EM64L-G09RevD.01
frameworkgroup: C1[X(C15H7Br2ClO2)]
method: RPBEPBE
basis: SDD
operation: Freq
keyword: #p
keyword: freq=noraman
keyword: PBEPBE/SDD
title: #p freq=noraman PBEPBE/SDD
converged: YES YES NO NO
title: Mulliken charges:
elementType: Br Br Cl O O C C C C C C C C C C C C C C C H H H H H H H
charge: 0.057432 0.035854 -0.037363 -0.279281 -0.222468 0.301130 0.386393 0.257455 -0.420148 -0.000975 -0.354274 -0.396364 0.291787 -0.228004 -0.151653 -0.308908 -0.335698 -0.220509 -0.221415 -0.111410 0.304240 0.276088 0.273368 0.295683 0.285943 0.261061 0.262037
chargesum: 0.00000
title: Mulliken charges with hydrogens summed into heavy atoms:
elementType: Br Br Cl O O C C C C C C C C C C C C C C C
charge: 0.057432 0.035854 -0.037363 -0.279281 -0.222468 0.301130 0.386393 0.257455 -0.115908 -0.000975 -0.078186 -0.396364 0.291787 -0.228004 0.121715 -0.013225 -0.049755 0.040552 0.040622 -0.111410
polarizability: 4.08901711e+02 1.95429499e+01 2.32161103e+02 -1.61234128e+00 1.98613430e+00 7.21250956e+01
1716.lowfreq: -3.5020 -1.4500 0.0002 0.0010 0.0010 1.7701 10.1655 21.9577 41.4585
frequency: 9.8186 21.8935 41.4567 67.9730 89.4143 106.8095 115.6456 132.8472 148.0579 182.0066 222.7266 249.8512 272.2698 277.6211 303.5653 316.9165 344.2946 372.8458 405.9562 443.3064 470.3952 505.2042 510.8957 556.6068 570.5418 585.3040 620.7572 626.6984 683.2564 692.0084 710.9516 739.9560 757.1458 820.8539 837.9664 848.6206 853.0549 860.3054 868.2802 901.6272 921.4203 930.3740 981.4467 994.9097 999.6035 1068.2273 1073.4177 1112.0844 1115.5033 1143.2053 1191.2434 1197.2062 1227.5207 1258.9311 1283.9117 1301.8146 1368.5455 1371.1760 1401.6360 1404.5318 1428.3468 1474.0363 1504.1602 1549.5379 1564.3733 1576.9015 1595.6523 1607.3983 3155.9170 3168.3445 3176.5198 3179.6489 3185.2113 3200.2350 3242.2508
redmass: 8.5318 5.7508 19.4139 10.1381 11.2927 19.5831 20.2894 6.7214 8.3012 12.7079 16.1426 6.2093 5.0022 11.7109 6.4221 9.8027 8.9110 9.2026 2.9151 8.3021 3.6569 6.1481 5.2444 6.9413 4.2945 4.2065 7.4178 7.5119 10.1718 4.3055 7.5944 4.9503 3.4698 7.3950 1.2670 8.6776 1.4567 1.5305 1.4148 1.5520 4.5687 7.2197 1.3664 1.3628 4.0105 2.2795 2.8828 1.9401 1.4065 3.5818 1.1680 1.9467 2.2778 3.4354 3.6230 1.2759 4.9464 5.0774 4.2279 5.7969 4.4898 2.3478 10.2904 7.9635 8.2981 7.7714 6.1984 9.6266 1.0887 1.0913 1.0968 1.0938 1.0929 1.0946 1.0986
irintensity: 0.2569 0.0055 0.2048 0.2796 2.3219 0.0236 0.1221 3.1943 0.1366 3.7625 3.4170 2.8126 0.4053 3.2677 1.5158 1.2719 0.0331 0.2034 0.0225 52.2076 12.2406 1.8175 2.0464 14.3567 2.6728 9.4370 2.5090 7.0214 68.3003 7.9701 5.4255 19.3545 35.5374 46.3707 3.3068 52.6995 34.0472 0.2434 22.0019 44.0558 97.9376 14.0980 1.0049 1.5961 43.6440 4.9460 74.3769 44.6362 7.0165 126.1027 75.3665 7.3605 17.6375 220.2828 227.6863 0.2472 28.3014 5.7910 7.0277 25.1345 17.6216 33.0323 170.8391 329.1919 27.7382 24.0706 149.2640 0.8897 0.4775 1.0879 4.4619 0.3142 1.5892 11.1686 4.2630
temp: 298.150 k
press: 1.00000 atm
elementType: 35 35 17 8 8 6 6 6 6 6 6 6 6 6 6 6 6 6 6 6 1 1 1 1 1 1 1
symmnumber: 1
zpe: 455184.8 jmol-1
zpe.correction: 0.173371 hartree
zpe.thermalcorrener: 0.190751 hartree
zpe.thermalcorrenthalpy: 0.191695 hartree
zpe.thermalcorrgfe: 0.123281 hartree
zpe.sumelectzpe: -1211.847565 hartree
zpe.sumelectthermal: -1211.830185 hartree
zpe.sumelectthermalent: -1211.829241 hartree
zpe.sumelectthermalfe: -1211.897654 hartree
dipole: -1.1890 0.4053 0.0734
dipole: 1.2583
quadrupole: -143.1848 -138.7569 -143.8686
quadrupole: 1.1330 -0.3159 0.2910
quadrupole: -1.2480 3.1798 -1.9318 1.1330 -0.3159 0.2910
hfenergy: -1212.0209355 hartree
pointgroup: C01 [X(C15H7Br2Cl1O2)]
dipole: 0.4623794 -0.1340879 0.1153553 debye
polarizability: 407.7825563|24.3395648|210.6319|16.0876072|-53.5793347|94.773454 unknown
InChI: InChI=1S/C15H7Br2ClO2/c16-10-5-9-6-13(20-15(9)12(17)7-10)14(19)8-1-3-11(18)4-2-8/h1-7H
charge 0 multiplicity 1
27 atoms
Br 1.805842 -3.114697 1.310882
Br 6.632206 0.037307 0.524707
Cl -6.313726 -1.660161 0.279732
O  0.539373 -0.304402 0.16745
O  -1.224968 2.640895 -1.121136
C  2.532599 0.85468 -0.106443
C  1.928889 -0.374443 0.302764
C  0.260999 1.006377 -0.341847
C  1.443955 1.713959 -0.512261
C  -1.120701 1.466211 -0.632194
C  3.943076 0.999303 -0.048412
C  2.677926 -1.465644 0.766822
C  -2.340137 0.633574 -0.380512
C  4.680408 -0.100739 0.418583
C  4.078616 -1.32599 0.825452
C  -2.336684 -0.657907 0.218353
C  -3.584725 1.20644 -0.770937
C  -3.545474 -1.355979 0.421168
C  -4.795542 0.519543 -0.576614
C  -4.756262 -0.75874 0.020408
H  1.498312 2.732558 -0.889096
H  4.435005 1.925669 -0.35357
H  4.69769 -2.153027 1.180976
H  -1.400498 -1.124637 0.527806
H  -3.574746 2.201448 -1.227222
H  -3.544106 -2.347366 0.882621
H  -5.748828 0.961671 -0.87908
