program: Gaussian 09
title: 000015981
version: EM64L-G09RevD.01
frameworkgroup: C1[X(C14H16N2O)]
method: RPBEPBE
basis: SDD
operation: Freq
keyword: #p
keyword: freq=noraman
keyword: PBEPBE/SDD
title: #p freq=noraman PBEPBE/SDD
converged: YES YES NO NO
title: Mulliken charges:
elementType: O N N C C C C C C C C C C C C C C H H H H H H H H H H H H H H H H
charge: -0.462745 -0.368935 -0.082764 -0.507703 -0.193731 -0.364828 0.460845 -0.428627 -0.383917 0.170906 -0.233182 -0.224196 -0.240833 -0.299467 -0.187135 -0.336502 -0.207644 0.243704 0.197534 0.216476 0.226510 0.236861 0.304427 0.252944 0.267751 0.336621 0.228315 0.224054 0.227442 0.236974 0.230294 0.232343 0.228206
chargesum: 0.00000
title: Mulliken charges with hydrogens summed into heavy atoms:
elementType: O N N C C C C C C C C C C C C C C
charge: -0.126125 -0.064507 -0.082764 -0.066466 0.022745 0.098543 0.460845 -0.175683 -0.116166 0.170906 -0.004867 -0.000142 -0.013391 -0.062493 0.043159 -0.104158 0.020563
polarizability: 2.06338554e+02 -1.56542666e+01 1.71744827e+02 3.04829947e+01 7.87685871e+00 1.11420709e+02
1716.lowfreq: -13.2722 -2.9824 -0.0006 -0.0004 0.0002 5.1665 16.4389 22.5747 34.0757
frequency: 15.9361 22.4801 34.0471 56.8590 92.7479 121.2057 160.6271 210.1192 214.5874 240.6133 270.9203 281.5528 352.0957 398.3167 404.5829 408.8252 435.5592 476.4039 492.2705 539.2478 544.8444 587.4866 605.2813 616.1176 634.9917 707.9330 733.8094 740.9339 767.4233 773.0076 830.0690 851.2094 861.6505 864.5035 920.6315 937.1513 945.0398 955.6660 979.5232 982.0287 983.3386 990.2177 997.8691 1024.8051 1036.6093 1045.8441 1074.3191 1083.5983 1094.9220 1118.2687 1154.0508 1165.3803 1171.8434 1186.3217 1202.2638 1218.1760 1242.7563 1258.8678 1295.4752 1318.3784 1321.3137 1338.4277 1346.7951 1364.6340 1380.9887 1399.0228 1415.3370 1438.2322 1441.6739 1455.2902 1485.8391 1491.8767 1505.3332 1561.4250 1594.4307 1601.6104 1615.8497 2930.2802 2953.3529 2962.3275 3010.7619 3053.8547 3117.2385 3124.5428 3126.4283 3135.9555 3140.2542 3156.3807 3162.6071 3168.0603 3175.6664 3535.4894 3558.2144
redmass: 5.0127 4.7095 3.9108 4.7789 5.2038 4.2275 3.4509 4.5767 4.9817 2.5065 2.0691 1.4614 3.1157 4.1701 2.8667 3.3735 3.3000 1.5068 4.0120 2.1293 2.7895 3.7968 5.8437 6.4188 5.2839 1.8119 1.7612 2.9606 1.7745 2.2965 3.6876 1.4388 1.2512 1.9166 1.6833 2.4511 1.4101 3.7228 1.3196 5.2314 1.4487 5.1421 1.3446 2.2677 2.2236 1.7705 2.0357 1.6491 2.2271 2.1435 1.4406 1.0865 1.0555 1.1297 1.4283 1.5104 1.2631 1.6176 1.1493 1.6253 1.3669 1.4443 3.1138 1.4363 4.6097 1.8370 1.9260 1.9255 2.0709 1.1729 2.3507 1.1452 2.5074 4.9844 6.1371 6.2253 6.0771 1.0680 1.0694 1.0826 1.0924 1.0949 1.0867 1.0888 1.0873 1.0889 1.0928 1.0966 1.0935 1.0989 1.1006 1.0759 1.0660
irintensity: 0.0339 0.4323 0.3660 0.7705 1.8933 2.9692 5.8465 3.4758 1.0362 18.4690 18.9515 106.7494 5.8690 0.8031 0.3080 1.6644 19.2708 98.0295 26.3531 43.3325 4.7203 16.7594 3.4952 0.2098 0.5335 58.6746 27.8968 3.4618 74.3061 56.7337 2.4293 3.1701 0.8136 15.9667 10.5853 8.3620 1.1064 3.2646 0.2915 76.1193 1.5342 0.0528 0.7130 8.6494 6.7021 0.1712 9.5997 4.2777 0.6545 4.3314 76.8903 5.4176 1.1222 6.0778 34.5958 8.9501 1.8790 0.4468 4.1116 45.3369 2.0078 1.1435 8.6398 8.7253 5.7656 16.9006 34.2084 7.2955 32.0040 41.1515 13.0096 132.9511 158.1515 29.1465 1.6597 344.6451 3.6438 54.9699 59.8477 34.3113 29.0212 30.5895 5.6433 24.6066 1.9969 11.3611 30.2496 24.4836 30.8447 12.8639 13.5523 28.1661 7.5641
temp: 298.150 k
press: 1.00000 atm
elementType: 8 7 7 6 6 6 6 6 6 6 6 6 6 6 6 6 6 1 1 1 1 1 1 1 1 1 1 1 1 1 1 1 1
symmnumber: 1
zpe: 710588.4 jmol-1
zpe.correction: 0.270649 hartree
zpe.thermalcorrener: 0.286141 hartree
zpe.thermalcorrenthalpy: 0.287085 hartree
zpe.thermalcorrgfe: 0.225060 hartree
zpe.sumelectzpe: -726.570505 hartree
zpe.sumelectthermal: -726.555013 hartree
zpe.sumelectthermalent: -726.554069 hartree
zpe.sumelectthermalfe: -726.616094 hartree
dipole: -0.2648 -0.1715 2.1080
dipole: 2.1315
quadrupole: -105.8606 -87.4936 -102.4306
quadrupole: -4.2925 4.1012 0.0662
quadrupole: -7.2657 11.1013 -3.8357 -4.2925 4.1012 0.0662
hfenergy: -726.841154 hartree
pointgroup: C01 [X(C14H16N2O1)]
dipole: -0.1160592 -0.1440684 0.8179413 debye
polarizability: 204.8398276|-19.4657227|170.5749584|30.1015165|12.5998949|114.0893034 unknown
InChI: InChI=1S/C14H16N2O/c17-13(12-6-2-1-3-7-12)9-11-16-14-8-4-5-10-15-14/h1-8,10,13,16-17H,9,11H2
charge 0 multiplicity 1
33 atoms
O  2.838508 -2.496851 -0.83124
N  -1.304087 -1.244241 0.063827
N  -3.339056 -0.713953 -0.938896
C  0.939873 -2.090632 0.700438
C  1.729499 -1.566045 -0.535449
C  -0.271968 -1.230658 1.106125
C  2.346292 -0.195935 -0.294157
C  1.633185 0.977109 -0.645216
C  3.616845 -0.076233 0.321544
C  -2.431114 -0.436346 0.058325
C  2.176242 2.254106 -0.374803
C  4.162176 1.199673 0.586114
C  3.442494 2.368954 0.243925
C  -2.638411 0.612966 1.007237
C  -3.806298 1.390735 0.897401
C  -4.458081 0.055654 -1.015269
C  -4.743598 1.120494 -0.130298
H  1.640194 -2.147132 1.554202
H  0.596471 -3.127789 0.492109
H  1.042848 -1.507538 -1.406409
H  -0.676394 -1.604873 2.07274
H  0.066495 -0.19041 1.276919
H  -1.339065 -2.021324 -0.600066
H  0.655676 0.891639 -1.136766
H  4.177831 -0.985932 0.557068
H  2.468795 -3.407897 -0.954626
H  1.616512 3.153929 -0.653829
H  5.150382 1.283402 1.052907
H  3.86788 3.358086 0.448291
H  -1.911936 0.807409 1.8009
H  -3.98656 2.201621 1.612064
H  -5.151872 -0.202455 -1.824455
H  -5.660659 1.705868 -0.239959
