program: Gaussian 09
title: 000186313
version: EM64L-G09RevD.01
frameworkgroup: C1[X(C20H25NO4)]
method: RPBEPBE
basis: SDD
operation: Freq
keyword: #p
keyword: freq=noraman
keyword: PBEPBE/SDD
title: #p freq=noraman PBEPBE/SDD
converged: YES YES NO NO
title: Mulliken charges:
elementType: O O O O N C C C C C C C C C C C C C C C C C C C C H H H H H H H H H H H H H H H H H H H H H H H H H
charge: -0.265267 -0.265490 -0.216290 -0.195284 0.144275 -0.395697 0.499287 0.465922 -0.412105 -0.423337 -0.385254 -0.389845 -0.405034 -0.383150 -0.383252 -0.355689 -0.382884 0.342529 0.337786 -0.255453 -0.254805 -0.394333 -0.394530 -0.678505 -0.677740 0.267342 0.253985 0.263720 0.255075 0.240917 0.242994 0.227182 0.251704 0.251540 0.245133 0.246773 0.201571 0.200235 0.200592 0.201570 0.218803 0.219982 0.219313 0.219688 0.210006 0.209473 0.227926 0.209816 0.210019 0.228785
chargesum: 0.00000
title: Mulliken charges with hydrogens summed into heavy atoms:
elementType: O O O O N C C C C C C C C C C C C C C C C C C C C
charge: -0.265267 -0.265490 -0.216290 -0.195284 0.144275 -0.128355 0.499287 0.465922 0.105601 -0.168262 -0.144337 -0.146851 -0.177853 -0.131446 -0.131712 -0.110556 -0.136112 0.342529 0.337786 0.146353 0.147357 0.044453 0.044471 -0.031100 -0.029119
polarizability: 3.19078696e+02 -1.15655435e+01 2.26479433e+02 -1.11293919e+01 9.40633560e+00 1.97836803e+02
1716.lowfreq: -8.5388 -0.7097 -0.0007 -0.0005 0.0008 2.4274 11.4276 19.6337 23.9793
frequency: 10.1410 19.6123 23.9369 32.4932 43.3544 49.4269 50.7198 63.6850 78.1465 80.4440 86.4367 111.9629 114.9156 137.2208 148.0980 166.2718 185.5866 190.6030 222.5866 227.2126 229.9186 263.1722 281.0687 298.5559 321.6193 350.1039 373.7968 393.1196 411.0561 413.9800 464.5216 475.8564 488.9419 510.4100 534.9015 560.4420 589.3253 596.8781 631.6163 636.3171 661.4032 713.3143 733.3997 747.4506 767.6402 767.9613 786.0313 806.6782 814.4252 817.7514 829.5248 837.6718 846.1341 878.4708 895.3570 896.0866 902.1490 902.6206 932.2029 944.4523 966.8070 967.5655 975.9014 981.7426 984.5480 1003.4083 1005.5588 1048.6735 1053.5918 1055.2947 1116.1832 1122.1865 1135.5982 1136.1505 1141.2088 1142.5496 1176.7149 1180.3114 1185.8727 1194.6301 1211.3627 1227.2066 1228.3397 1229.3848 1230.2606 1230.5371 1261.1610 1285.8006 1286.4746 1293.0595 1308.6758 1310.1353 1310.5914 1318.8880 1328.2023 1370.5406 1376.1436 1382.9140 1390.8065 1395.4219 1396.4154 1419.5238 1422.0507 1425.3607 1448.7063 1472.1399 1472.8668 1479.4023 1479.8651 1480.1742 1481.5548 1488.9055 1489.8046 1500.4291 1503.8650 1579.9314 1582.2067 1621.6457 1624.3434 2943.3984 2944.3408 2978.0942 2978.4779 3001.2338 3002.1621 3004.7034 3005.3705 3009.6522 3021.1255 3052.2334 3052.5467 3080.7214 3080.9942 3083.7405 3084.2936 3117.7922 3126.3584 3128.1572 3128.8090 3133.1661 3162.0373 3162.6636 3166.8939 3167.4537
redmass: 3.5777 4.4028 3.8939 5.1509 5.0624 4.3379 5.8282 4.7305 2.4807 2.0508 2.5319 4.5564 3.2861 2.6026 2.9242 4.7890 5.4368 4.7034 1.2244 2.1879 1.4977 4.4405 3.9756 4.3451 3.9192 4.9810 5.0814 4.4592 2.9469 2.9724 4.0508 3.9083 3.8592 3.1122 3.0799 4.9802 4.1344 4.0491 7.0895 6.2530 7.6438 4.0638 3.4444 3.6074 1.0881 1.0842 4.5696 3.7888 1.6027 1.3888 3.2614 1.4759 2.2362 4.0870 1.1477 1.1448 1.7243 1.7180 1.3889 1.3674 1.3838 1.3654 2.5787 6.6959 4.6028 2.8064 2.4808 3.6948 2.8426 2.7708 1.3739 1.3873 2.1578 2.1703 1.4416 1.4487 1.3527 1.2939 1.5945 2.0286 1.6922 3.4962 3.4104 1.3656 2.3704 1.2644 1.9183 1.1044 1.1032 1.4193 1.3701 1.3543 1.3627 1.4670 1.5769 2.6092 1.6435 1.8105 2.0671 1.2398 1.4498 3.6948 3.1337 2.2260 1.4408 1.0841 1.0789 1.0986 1.0771 1.0543 1.0416 1.1685 1.1402 2.0003 2.1786 7.1099 6.8125 6.3159 6.3362 1.0550 1.0550 1.0362 1.0363 1.1063 1.1062 1.0601 1.0603 1.0827 1.0609 1.1014 1.1013 1.1030 1.1030 1.0988 1.0987 1.1021 1.0891 1.0888 1.0892 1.0895 1.0937 1.0936 1.0954 1.0955
irintensity: 0.3654 0.2020 0.4492 0.3309 0.1760 0.0657 2.1634 1.1761 0.0761 0.8499 0.2425 3.0784 1.7054 2.8907 2.3733 1.8940 3.8565 0.9657 0.4312 1.0909 0.3211 0.8949 2.4056 0.6431 0.6053 0.9372 0.3021 0.9668 0.3967 0.1203 0.4047 0.2479 0.8508 6.0208 16.7517 27.1080 18.1873 40.3531 1.4979 3.2535 5.1668 1.9928 1.4219 15.7497 13.0703 10.8438 12.5775 21.8568 2.8250 15.1897 3.1844 50.4204 47.8155 4.9541 2.6245 2.2673 7.1219 8.5026 0.7233 0.5377 1.3390 0.9249 47.2394 108.3471 52.2942 5.7215 12.0309 1.3204 5.7970 6.2900 7.8057 23.7677 7.0168 6.7743 0.2439 0.2264 103.2452 63.9414 125.0091 8.9179 20.9615 162.4462 77.0594 29.6798 229.8202 1.5723 10.7827 0.0004 0.0042 12.1316 5.0957 0.8371 1.0555 3.2685 10.4826 5.0493 5.5934 10.4189 3.8126 31.4613 32.2875 4.9056 10.8251 98.2427 25.6960 25.5126 21.2197 12.5118 8.4530 12.5698 13.6033 96.8455 45.6958 110.7499 73.6464 6.4955 28.0211 75.9366 45.3563 30.5937 36.2665 36.1710 39.9849 28.0166 28.7057 23.6936 23.6750 4.6647 11.4171 0.0128 0.0149 79.4983 82.1892 45.2589 43.4660 6.5522 15.7096 10.5496 14.9443 8.6276 12.6850 16.6484 4.5420 4.7115
temp: 298.150 k
press: 1.00000 atm
elementType: 8 8 8 8 7 6 6 6 6 6 6 6 6 6 6 6 6 6 6 6 6 6 6 6 6 1 1 1 1 1 1 1 1 1 1 1 1 1 1 1 1 1 1 1 1 1 1 1 1 1
symmnumber: 1
zpe: 1075952.4 jmol-1
zpe.correction: 0.409809 hartree
zpe.thermalcorrener: 0.435589 hartree
zpe.thermalcorrenthalpy: 0.436533 hartree
zpe.thermalcorrgfe: 0.348782 hartree
zpe.sumelectzpe: -1130.808891 hartree
zpe.sumelectthermal: -1130.783111 hartree
zpe.sumelectthermalent: -1130.782166 hartree
zpe.sumelectthermalfe: -1130.869917 hartree
dipole: 3.6058 -4.9494 -2.0121
dipole: 6.4457
quadrupole: -131.6821 -159.0075 -146.4429
quadrupole: 15.6011 -8.3032 7.0232
quadrupole: 14.0287 -13.2967 -0.7321 15.6011 -8.3032 7.0232
hfenergy: -1131.2186995 hartree
pointgroup: C01 [X(C20H25N1O4)]
dipole: -1.4340945 1.9136588 -0.8439417 debye
polarizability: 319.0548808|-9.9717879|225.8513276|13.0259714|-9.8721735|198.4887237 unknown
InChI: InChI=1S/C20H25NO4/c1-3-13-24-18-9-5-16(6-10-18)20(15-21(22)23)17-7-11-19(12-8-17)25-14-4-2/h5-12,20H,3-4,13-15H2,1-2H3
charge 0 multiplicity 1
50 atoms
O  4.718752 1.406969 0.51755
O  -4.938631 1.173356 0.661477
O  1.342011 -4.409102 0.469766
O  1.870637 -4.130489 -1.729539
N  1.170809 -3.866466 -0.685217
C  -0.036902 -1.881411 0.359148
C  1.197979 -0.965522 0.395428
C  -1.358159 -1.10333 0.361456
C  0.030303 -2.861797 -0.839116
C  2.312691 -1.298631 1.211069
C  -1.806824 -0.532416 1.584581
C  1.273582 0.205333 -0.395538
C  -2.145795 -0.888552 -0.793601
C  3.465274 -0.492548 1.231416
C  -2.993418 0.214198 1.654293
C  2.42386 1.024286 -0.390506
C  -3.346242 -0.139446 -0.744769
C  3.527975 0.671964 0.426848
C  -3.772551 0.415638 0.48551
C  4.844829 2.624669 -0.305225
C  -5.790634 1.415394 -0.518516
C  6.229508 3.214391 -0.026991
C  -6.978605 2.259558 -0.050908
C  6.471853 4.505242 -0.839398
C  -7.944996 2.575595 -1.213227
H  -0.011635 -2.513855 1.267554
H  0.216632 -2.36273 -1.801866
H  -0.890088 -3.471669 -0.899628
H  2.277833 -2.201871 1.831259
H  -1.209675 -0.675585 2.493095
H  0.414825 0.500686 -1.009891
H  -1.840451 -1.303547 -1.761311
H  4.3264 -0.745211 1.857388
H  -3.339853 0.648973 2.596785
H  2.445071 1.924967 -1.011043
H  -3.928906 -0.0005 -1.660108
H  4.733472 2.36276 -1.378697
H  4.044817 3.344745 -0.031238
H  -5.205688 1.94953 -1.297036
H  -6.132575 0.444605 -0.935715
H  6.318196 3.420069 1.055931
H  6.995611 2.456091 -0.273722
H  -6.596245 3.196011 0.396013
H  -7.509205 1.71416 0.751544
H  6.409133 4.315218 -1.927466
H  5.729065 5.285767 -0.588322
H  7.474598 4.916608 -0.628538
H  -7.440476 3.147674 -2.014484
H  -8.352391 1.650288 -1.662419
H  -8.798368 3.179131 -0.857473
