program: Gaussian 09
title: 000016040
version: EM64L-G09RevD.01
frameworkgroup: C1[X(C20H30O2)]
method: RPBEPBE
basis: SDD
operation: Freq
keyword: #pfreq=noraman
keyword: PBEPBE/SDD
title: #p freq=noraman PBEPBE/SDD
converged: NO YES NO NO
title: Mulliken charges:
elementType: O O C C C C C C C C C C C C C C C C C C C C H H H H H H H H H H H H H H H H H H H H H H H H H H H H H H
charge: -0.426796 -0.222701 0.213178 -0.159329 0.264589 -0.480965 -0.546192 0.256299 -0.461428 -0.448552 -0.575214 0.228056 -0.810574 -0.578389 -0.782064 0.065981 -0.592628 -0.618962 0.557673 -0.260639 -0.710500 -0.700405 0.248713 0.217372 0.196962 0.222114 0.223235 0.223804 0.199246 0.237826 0.198071 0.216696 0.219035 0.248598 0.226350 0.232608 0.215316 0.216159 0.227058 0.242241 0.227160 0.213504 0.211115 0.234594 0.214580 0.375758 0.216198 0.225597 0.213763 0.228312 0.204379 0.213193
chargesum: 0.00000
title: Mulliken charges with hydrogens summed into heavy atoms:
elementType: O O C C C C C C C C C C C C C C C C C C C C
charge: -0.051037 -0.222701 0.213178 0.089384 0.264589 -0.066631 -0.100842 0.256299 -0.038378 -0.012655 -0.139483 0.228056 -0.103018 -0.146913 -0.085605 0.065981 -0.168008 -0.384368 0.557673 -0.046059 -0.054942 -0.054520
polarizability: 2.80158750e+02 -2.83966350e+00 2.00707613e+02 -2.50217446e+00 1.76060686e+00 1.74155614e+02
1716.lowfreq: -10.0912 -6.6499 -0.0002 0.0002 0.0006 7.4813 31.4371 47.7475 73.6591
frequency: 31.3512 47.7164 73.6505 84.7783 89.1712 108.5674 126.6157 154.8470 162.8059 200.1005 206.9226 215.4907 227.7596 231.4749 243.0479 246.4929 266.7257 271.5865 290.5378 292.6397 301.5136 313.0877 323.1926 345.9188 353.9234 386.3291 414.7049 429.8043 452.1053 454.9414 462.7104 506.9420 514.4694 540.5921 550.7588 570.5506 586.6527 599.6097 621.8905 639.5155 678.4170 710.7106 730.1844 761.0862 781.4792 819.6060 843.4565 854.6649 865.3499 882.6514 893.1971 902.8733 910.8207 916.7999 951.3291 954.4936 962.8997 968.2243 982.3930 995.4308 1009.9394 1025.6362 1030.2182 1037.6892 1044.6670 1065.4614 1071.3140 1083.3005 1087.6059 1101.1017 1109.9860 1130.5046 1149.2489 1153.0656 1157.8309 1169.2506 1186.3711 1191.0707 1204.3049 1215.5149 1225.1456 1231.0105 1239.7229 1264.6664 1268.1132 1291.3049 1294.7643 1305.5660 1307.8250 1313.8542 1319.9238 1327.2927 1336.3877 1341.1152 1345.7826 1353.8315 1370.5228 1371.9848 1383.3113 1390.0405 1390.3209 1392.6657 1448.3381 1451.6797 1453.8135 1457.6370 1461.1113 1467.4636 1467.6055 1471.4606 1474.2417 1478.7286 1479.7286 1485.1647 1487.3956 1490.2554 1501.0566 1620.3854 1636.8434 1664.1513 2924.7527 2935.6756 2943.2453 2971.2378 2971.3000 2973.9049 2975.1403 2979.7992 2983.2350 2986.1936 2990.1308 2991.1611 2994.1671 3005.5747 3021.6785 3024.0307 3027.4912 3042.6516 3055.5850 3059.8776 3062.7968 3069.9509 3074.4080 3077.5870 3079.4721 3079.5928 3085.0026 3093.4082 3100.4483 3511.2987
redmass: 4.0108 2.7706 3.7924 5.8834 4.2976 4.0726 3.1422 3.0624 2.8292 1.2546 1.9163 2.0839 1.9152 1.4968 2.0833 1.4641 2.5387 1.5479 2.1393 2.4732 2.4891 1.7886 2.3349 3.5135 2.2454 3.1642 2.9820 2.5094 3.5052 3.0434 2.8668 3.0139 3.7071 2.4935 2.7736 2.3606 1.5851 2.3276 2.9863 3.1536 2.9341 2.9711 5.2987 2.4598 2.7210 1.8033 2.6190 1.7740 1.8885 1.5521 2.1000 2.1619 2.1775 1.2232 1.4294 1.9753 2.2099 1.9090 1.5866 2.0574 2.2537 1.9640 2.1268 2.0742 2.3004 2.8968 1.7598 2.3677 1.5488 2.4221 2.4933 1.9076 1.4613 1.8250 1.4828 1.6985 2.0009 1.8633 1.6468 1.9040 1.5642 1.8217 1.7179 1.6754 1.6191 1.4453 1.5425 1.3183 1.4747 1.5430 1.6150 1.5246 1.4085 1.3861 1.4589 1.4798 1.7706 1.1970 1.7777 1.2059 1.2144 1.2676 1.0811 1.0914 1.0891 1.0855 1.0788 1.0640 1.0546 1.0561 1.0710 1.0456 1.0726 1.0767 1.0587 1.0565 1.0511 8.0977 8.3736 7.1521 1.0701 1.0649 1.0636 1.0503 1.0449 1.0506 1.0678 1.0646 1.0634 1.0418 1.0638 1.0619 1.0601 1.0818 1.0929 1.0916 1.0973 1.0982 1.1001 1.0992 1.0997 1.0989 1.1006 1.0980 1.0991 1.0993 1.0904 1.0968 1.1010 1.0639
irintensity: 0.0343 0.0461 0.2727 0.5862 0.4889 0.3047 0.0419 0.1556 0.7769 0.4229 0.6700 0.3320 0.2405 0.1904 0.1829 0.0225 0.9409 0.8151 0.3066 1.7196 1.8092 0.3252 0.2489 3.4170 0.8088 0.3502 2.0906 2.1470 1.1164 2.9510 5.1501 1.3470 10.5627 0.6569 8.5239 16.7340 74.8102 43.1277 1.0449 9.3220 5.3407 4.4698 29.7122 0.7536 1.7086 6.4656 3.5640 5.8733 12.6788 6.8580 14.5325 3.8795 0.9696 4.2353 0.2023 15.1909 16.5840 2.8022 4.7853 7.0481 170.3541 13.0617 7.0831 9.7737 12.8702 17.7909 26.6375 2.5219 3.4181 2.0112 3.5280 5.0552 6.8969 5.5747 4.3233 4.3412 0.9463 1.8618 0.8369 2.4277 8.4594 9.0853 5.1112 12.9144 7.7379 3.8058 11.0123 0.7328 2.1609 5.1694 4.3968 3.5122 2.0563 4.2488 0.4085 1.9468 0.5504 18.5530 8.3399 13.6484 6.6885 17.5631 2.7651 10.9630 7.4552 5.7920 2.5435 5.2190 4.0860 5.4840 21.6301 15.3318 11.6151 18.5731 11.8890 10.8579 6.5954 2.3135 183.6599 13.2540 22.2398 48.5017 39.4498 19.2112 42.7322 39.3931 28.3244 5.0144 3.8010 41.4181 19.3621 36.7662 28.1279 57.9185 15.1557 38.3752 53.7308 31.3686 35.8086 49.9971 2.5259 97.3391 25.8650 29.6910 1.3215 76.2442 41.9653 32.5671 19.0261 22.6390
temp: 298.150 k
press: 1.00000 atm
elementType: 8 8 6 6 6 6 6 6 6 6 6 6 6 6 6 6 6 6 6 6 6 6 1 1 1 1 1 1 1 1 1 1 1 1 1 1 1 1 1 1 1 1 1 1 1 1 1 1 1 1 1 1
symmnumber: 1
zpe: 1194379.5 jmol-1
zpe.correction: 0.454915 hartree
zpe.thermalcorrener: 0.477200 hartree
zpe.thermalcorrenthalpy: 0.478144 hartree
zpe.thermalcorrgfe: 0.405828 hartree
zpe.sumelectzpe: -928.867071 hartree
zpe.sumelectthermal: -928.844786 hartree
zpe.sumelectthermalent: -928.843842 hartree
zpe.sumelectthermalfe: -928.916159 hartree
dipole: -1.2463 0.9878 0.1052
dipole: 1.5938
quadrupole: -138.7297 -133.3227 -130.7881
quadrupole: 7.6778 2.5288 -1.0820
quadrupole: -4.4495 0.9575 3.4920 7.6778 2.5288 -1.0820
hfenergy: -929.3219864 hartree
pointgroup: C01 [X(C20H30O2)]
dipole: 0.492722 0.3876728 -0.011688 debye
polarizability: 280.2018842|2.5364265|200.7888772|-2.0495629|0.2192705|174.0312164 unknown
InChI: InChI=1S/C20H30O2/c1-13(2)14-6-8-16-15(12-14)7-9-17-19(16,3)10-5-11-20(17,4)18(21)22/h12-13,17,21H,5-11H2,1-4H3
charge 0 multiplicity 1
52 atoms
O  -3.628742 0.355508 -2.159817
O  -4.672075 -1.185777 -0.791324
C  -0.757026 -0.614868 -0.00887
C  -1.604675 0.717342 -0.101522
C  -3.1392 0.509231 0.229084
C  -1.043185 -1.346631 1.349806
C  -0.959374 1.826015 0.769138
C  0.753251 -0.304678 -0.086472
C  -3.337602 -0.26567 1.561215
C  -2.544371 -1.587668 1.618487
C  0.431599 2.191416 0.219858
C  1.287881 0.959321 -0.01901
C  -1.114406 -1.557624 -1.200898
C  1.723011 -1.465489 -0.33464
C  -3.902473 1.874776 0.312042
C  -3.868724 -0.230578 -0.902261
C  3.113208 -1.223448 0.293164
C  2.740287 1.168246 -0.189377
C  3.65408 0.157852 -0.066021
C  5.156439 0.380236 -0.190293
C  5.902837 -0.035283 1.107372
C  5.749451 -0.363211 -1.41996
H  -1.55054 1.068471 -1.152051
H  -0.619743 -0.74064 2.175461
H  -0.500053 -2.311712 1.362227
H  -0.863967 1.491463 1.820404
H  -1.587668 2.733694 0.773726
H  -4.41528 -0.462942 1.710694
H  -3.006765 0.394423 2.388099
H  -2.968171 -2.305801 0.892774
H  -2.668376 -2.045975 2.6191
H  0.951038 2.869605 0.926808
H  0.323074 2.76413 -0.726677
H  -2.15379 -1.921625 -1.150093
H  -0.98088 -1.032772 -2.163959
H  -0.47005 -2.453723 -1.20686
H  1.311867 -2.414397 0.057884
H  1.840747 -1.609025 -1.432477
H  -3.633071 2.410226 1.238144
H  -3.674444 2.516293 -0.556375
H  -4.994516 1.702168 0.338154
H  3.808147 -2.024379 -0.022979
H  3.033272 -1.296583 1.401187
H  3.084074 2.194317 -0.386964
H  5.322167 1.466368 -0.345008
H  -4.168068 -0.130199 -2.841289
H  5.776597 -1.115097 1.311294
H  5.52387 0.524137 1.981847
H  6.986921 0.162577 1.012302
H  5.254353 -0.0425 -2.354041
H  5.623693 -1.45826 -1.325238
H  6.832569 -0.157461 -1.512192
