program: Gaussian 09
title: 000186237
version: EM64L-G09RevD.01
frameworkgroup: C1[X(C12H9NO)]
method: RPBEPBE
basis: SDD
operation: Freq
keyword: #p
keyword: freq=noraman
keyword: PBEPBE/SDD
title: #p freq=noraman PBEPBE/SDD
converged: NO YES NO YES
title: Mulliken charges:
elementType: O N C C C C C C C C C C C C H H H H H H H H H
charge: -0.206060 -0.679789 -0.094142 0.359887 0.207055 -0.651245 0.347280 -0.028129 0.348999 -0.428019 -0.398412 -0.393600 -0.449248 -0.241719 0.256189 0.256120 0.247307 0.265139 0.203977 0.217029 0.222697 0.317616 0.321068
chargesum: 0.00000
title: Mulliken charges with hydrogens summed into heavy atoms:
elementType: O N C C C C C C C C C C C C
charge: -0.206060 -0.041105 -0.094142 0.359887 0.207055 -0.138937 0.347280 -0.028129 0.348999 -0.180712 -0.133273 -0.189624 -0.232219 -0.019022
polarizability: 2.02051536e+02 1.60467927e+00 1.75744603e+02 2.11400620e-02 1.20331352e-02 5.76607341e+01
1716.lowfreq: -5.3627 -0.0006 -0.0003 0.0003 4.8834 6.1933 102.9248 110.2098 173.5328
frequency: 102.9241 110.2082 173.5326 221.0560 252.7386 298.6132 313.8669 386.2910 427.5794 436.9130 461.5473 464.8088 471.7432 515.0398 527.0880 560.6401 578.0370 637.4950 649.6204 662.4685 706.1412 763.8859 790.2099 813.1503 833.9524 889.4747 920.7932 941.4396 958.1308 964.3194 972.2556 992.9230 1046.9078 1083.2685 1121.8739 1152.1275 1178.9518 1195.6035 1203.9866 1255.0996 1263.9238 1318.3384 1382.2839 1387.9744 1416.4033 1436.9235 1464.1394 1478.4646 1524.7885 1595.7112 1599.6432 1624.1781 1628.9961 1647.8653 3002.3278 3054.0065 3113.0852 3120.5284 3133.4568 3154.8528 3156.4948 3563.7151 3702.2065
redmass: 6.3473 3.2983 3.8977 2.3773 6.2152 4.6733 4.2975 1.0926 5.8352 1.3539 6.7371 3.1684 2.4576 3.2314 4.8854 6.1317 4.3558 2.9675 5.6495 3.3787 5.1910 1.4634 5.4597 4.3839 1.4707 1.5205 3.8505 1.8199 6.5674 1.4041 1.5577 2.1946 2.3756 2.0541 1.1819 1.7352 1.3464 1.3227 1.8681 2.1514 2.8619 1.9654 4.0477 3.0162 1.2137 2.6622 4.4147 4.5330 4.7709 6.7349 8.6212 6.0616 6.2377 1.3666 1.0607 1.0999 1.0866 1.0886 1.0911 1.0979 1.0951 1.0452 1.1035
irintensity: 0.9516 6.3171 7.0430 2.7722 0.8557 11.6516 3.2779 53.6156 0.2672 182.7037 7.5816 4.8133 21.6126 5.2417 10.8650 3.9188 0.2931 0.5214 10.2013 0.3119 3.2494 76.6325 1.0874 7.4296 58.9317 0.0347 0.8738 4.4785 5.3021 0.2142 4.0974 14.8678 17.7811 51.9531 0.0409 3.0256 3.9162 11.5848 1.7543 3.6458 91.0839 22.1726 41.8483 49.9741 8.2921 31.0385 40.6212 5.1589 202.9864 92.4661 313.0382 33.7126 183.0220 181.1175 10.8409 4.9926 4.5761 22.4708 19.8164 35.1190 7.4733 105.9985 23.8572
temp: 298.150 k
press: 1.00000 atm
elementType: 8 7 6 6 6 6 6 6 6 6 6 6 6 6 1 1 1 1 1 1 1 1 1
symmnumber: 1
zpe: 465389.3 jmol-1
zpe.correction: 0.177257 hartree
zpe.thermalcorrener: 0.187774 hartree
zpe.thermalcorrenthalpy: 0.188718 hartree
zpe.thermalcorrgfe: 0.141602 hartree
zpe.sumelectzpe: -591.725857 hartree
zpe.sumelectthermal: -591.715340 hartree
zpe.sumelectthermalent: -591.714396 hartree
zpe.sumelectthermalfe: -591.761512 hartree
dipole: -6.4414 1.6276 0.0016
dipole: 6.6439
quadrupole: -74.4898 -71.2101 -85.1132
quadrupole: 13.6969 -0.0042 -0.0003
quadrupole: 2.4479 5.7276 -8.1755 13.6969 -0.0042 -0.0003
hfenergy: -591.9031143 hartree
pointgroup: C01 [X(C12H9N1O1)]
dipole: 2.5635557 0.5105602 -0.0006413 debye
dipolederiv: -1.3907727 -0.2753457 -0.0003003 -0.5478538 -0.5990917 -0.0001784 0.0005053 0.0002068 -0.3358495 -1.7434216 0.3248567 -0.0004963 0.113448 -0.1592832 -0.0002205 -0.0014352 0.0000532 -0.6785864 0.0676826 0.1055332 0.0000086 0.3081355 0.1460195 0.0000551 -0.0001596 0.0000791 -0.0228028 0.3159426 0.0293754 0.0000195 -0.0098475 -0.1015451 -0.0000268 0.0000503 -0.0000167 -0.0196056 -1.1591794 0.0840567 -0.000162 0.4606017 -0.4063311 0.0001303 -0.000261 0.0000726 -0.0200299 -0.0470321 0.0156234 0.0000812 0.0200989 -0.3623654 -0.0000279 0.000222 -0.0002121 0.1279454 -0.3297322 -0.0057082 -0.0000787 0.4620358 -0.0251556 0.0000921 -0.0001912 -0.000019 0.0377423 1.9766154 0.176762 0.0003643 0.0612333 0.8571308 0.0000408 -0.0002821 -0.0000879 0.109573 1.8149574 -0.3711939 0.0004083 0.0666522 0.1716766 0.0000504 0.0004451 -0.000015 0.1223912 0.0240262 -0.0811504 0.0000589 -0.1443578 0.0569538 -0.0000044 0.0000087 -0.0000024 -0.1826543 0.599163 -0.1691082 0.0001586 -0.2568326 0.2090972 -0.0001048 0.0000954 -0.0000736 -0.0972398 0.0263547 0.0916593 0.0001163 -0.1000744 -0.0316912 -0.0000454 0.0002101 -0.0000193 -0.1949349 -0.6872952 0.1067798 -0.0001042 -0.5858049 0.0465166 -0.0001294 0.0001508 -0.0000708 -0.23916 0.0023562 0.0353835 0.0000264 0.1536503 0.001152 0.0000551 0.0000564 0.0000304 -0.1541788 0.0272571 -0.0045037 0.064005 -0.0013487 0.063039 -0.0478496 0.1088707 -0.0610729 0.005359 0.0272235 -0.0044349 -0.0640572 -0.0012664 0.0630358 0.0479096 -0.1089659 0.061131 0.0052927 0.0341341 0.1012427 -0.0000229 0.0797857 -0.0632893 0.0000185 -0.0000232 0.0000217 0.1580667 0.0685494 -0.0831576 -0.0000035 -0.0509455 -0.0235016 0.0000135 -0.0000276 -0.0000149 0.1519399 -0.1480452 -0.033279 -0.0000797 0.0387777 0.0729714 0.0000121 -0.0001465 -0.0000149 0.1576627 -0.008492 0.1273388 -0.0000295 0.0953926 -0.0868077 0.0000286 0.0000203 0.0000424 0.1676501 0.0280595 -0.1011 -0.0000249 -0.0985736 -0.0913786 -0.0000145 -0.0000329 -0.0000364 0.1589229 0.2390583 -0.0380132 0.000062 -0.0777769 0.1412963 0.0000103 0.0003463 -0.0001375 0.3768895 0.2625906 -0.0316164 0.0000501 0.0148705 0.1215516 0.0001852 0.0005436 0.0001563 0.3656067 unknown
polarizability: 201.8202868|-2.9334262|175.9758528|0.0205003|-0.0130934|57.6607341 unknown
InChI: InChI=1S/C12H9NO/c13-10-5-4-9-11(14)6-7-2-1-3-8(10)12(7)9/h1-5H,6,13H2
charge 0 multiplicity 1
23 atoms
O  -3.41118 -1.261905 -0.000011
N  3.283748 -1.2507 0.000661
C  -0.13944 0.210562 -0.0001
C  -0.912762 1.412427 -0.000262
C  -0.958897 -0.957821 -0.000128
C  -2.385394 1.031863 -0.000345
C  1.283172 0.189868 0.000193
C  -2.378344 -0.534849 -0.000662
C  1.902438 -1.123982 0.000369
C  -0.246502 2.638076 -0.000201
C  -0.33931 -2.218458 0.000259
C  1.945385 1.4628 0.000269
C  1.078053 -2.287081 0.000459
C  1.191229 2.646878 0.00006
H  -2.933315 1.399836 0.887593
H  -2.93327 1.400098 -0.888196
H  -0.792451 3.587946 -0.000309
H  -0.936443 -3.136263 0.000256
H  3.039944 1.538826 0.000673
H  1.56483 -3.270478 0.000646
H  1.711734 3.611246 0.00017
H  3.717669 -2.169921 0.000505
H  3.890608 -0.43667 -0.000297
