program: Gaussian 09
title: 000186207
version: EM64L-G09RevD.01
frameworkgroup: C1[X(C24H15N)]
method: RPBEPBE
basis: SDD
operation: Freq
keyword: #pfreq=noraman
keyword: PBEPBE/SDD
title: #p freq=noraman PBEPBE/SDD
converged: YES YES NO NO
title: Mulliken charges:
elementType: N C C C C C C C C C C C C C C C C C C C C C C C C H H H H H H H H H H H H H H H
charge: -0.002500 0.042480 0.165035 -0.066905 0.259066 0.300080 0.171326 0.255425 -0.127645 0.469383 -0.118447 -0.355728 -0.412120 -0.459201 -0.439376 -0.606136 -0.389030 -0.478264 -0.265367 -0.322981 0.435564 -0.279449 -0.270157 -0.363096 -0.822394 0.266090 0.231977 0.241520 0.295447 0.278286 0.231957 0.244676 0.230488 0.265070 0.234638 0.233567 0.236252 0.233077 0.230340 0.227053
chargesum: 0.00000
title: Mulliken charges with hydrogens summed into heavy atoms:
elementType: N C C C C C C C C C C C C C C C C C C C C C C C C
charge: -0.002500 0.042480 0.165035 -0.066905 0.259066 0.300080 0.171326 0.255425 -0.127645 0.469383 -0.118447 -0.089638 -0.180144 -0.217681 -0.143928 -0.327849 -0.157073 -0.233588 -0.034879 -0.057911 0.435564 -0.044811 -0.036590 -0.126844 -0.131925
polarizability: 4.63560736e+02 2.29869801e+00 3.41619107e+02 -1.29051024e+01 5.65538597e+00 1.12148425e+02
1716.lowfreq: -10.3686 -5.6687 0.0000 0.0006 0.0009 0.4096 46.4638 68.1158 85.9498
frequency: 46.4446 68.1079 85.9377 97.7682 110.8473 131.9911 168.5501 200.2811 221.1332 247.2843 279.4210 293.9560 306.6154 329.6526 359.3054 388.1284 390.6983 411.3899 437.7290 442.2394 459.2373 495.4411 523.2769 526.4599 533.2618 560.7601 577.4372 582.2675 604.5293 615.7446 624.1582 648.4824 653.2968 707.4213 718.9734 737.3808 756.0243 767.1962 772.0959 786.7359 794.1447 825.0072 840.0442 840.9890 848.4043 855.4410 873.4965 913.9426 915.9664 929.6415 942.0395 971.6868 979.9701 982.2971 992.4667 995.1586 999.2191 1015.4839 1045.1283 1052.5507 1072.4977 1088.5512 1117.4727 1130.8608 1154.9693 1165.7558 1182.5318 1206.8866 1213.1256 1231.6811 1240.7178 1256.3388 1274.3724 1299.5866 1309.1428 1325.4863 1345.2827 1374.6010 1380.5871 1392.4001 1397.4539 1405.1306 1422.0381 1427.8777 1429.3769 1458.1486 1466.8923 1468.5052 1473.5554 1487.6942 1491.5068 1526.8250 1535.9106 1566.5149 1573.5232 1598.4329 1613.7708 1618.3290 1635.2318 2973.3551 3049.5426 3085.2123 3125.7763 3127.5626 3130.2076 3131.9792 3144.2526 3149.3863 3153.2625 3163.0411 3165.1913 3168.5284 3170.8515 3180.4788
redmass: 4.7719 4.0098 2.5741 1.2721 4.3940 3.8808 4.5493 4.0489 3.9191 4.6179 4.8701 5.6349 4.4914 4.4767 5.3888 5.8458 5.5411 4.0276 4.3663 4.0481 4.8428 3.8302 4.5629 3.8090 4.5075 5.5473 3.7170 5.2446 3.5416 6.9463 6.8153 6.0399 5.0662 3.1211 5.9845 6.4884 2.1432 1.4815 2.6312 5.2116 2.4839 2.8817 1.6011 5.9438 5.5483 1.9192 1.6275 1.4789 1.4277 5.6179 3.1932 1.3687 1.3437 1.3374 1.3821 2.7996 1.3945 1.9289 1.9741 1.8683 2.9046 2.0603 2.2173 1.4631 1.3113 1.5984 1.0992 1.3377 2.6234 1.8247 1.9499 2.7045 2.1476 1.9212 2.7235 3.7358 2.4892 4.4394 6.2831 3.2997 1.2511 6.0088 3.0483 3.9862 2.9357 3.0424 1.0940 1.5304 3.2599 2.6424 2.9020 4.5577 6.0564 7.8835 6.1239 6.5117 6.0283 6.4400 6.9247 1.0374 1.0973 1.0985 1.0890 1.0874 1.0881 1.0857 1.0912 1.0910 1.0916 1.0981 1.0960 1.0967 1.0940 1.0957
irintensity: 0.6642 0.1631 1.9062 0.2205 0.7435 0.5133 0.2133 0.6621 1.4248 0.8113 1.1526 1.4170 0.1700 0.2271 5.9733 0.3248 2.0964 4.7194 1.9115 0.2450 1.1212 0.3450 0.4248 3.6709 1.4638 4.9378 4.9614 4.0638 12.2525 8.1175 3.1444 2.1375 0.6086 1.7662 0.5438 0.4411 0.7321 73.3826 13.4977 0.1150 44.5877 4.0111 29.5771 1.8981 2.1174 63.6961 1.6135 7.0252 2.9605 0.7699 1.5720 1.3066 2.2925 0.3833 0.8601 0.0402 3.6778 12.1593 11.5411 3.6528 3.4511 6.0102 4.3279 7.6188 11.2689 4.1431 0.4205 7.9181 1.2312 1.0057 0.3431 0.2857 0.9489 8.0895 2.2314 7.2749 10.3412 0.5838 0.1538 7.8623 9.6153 3.2195 10.5232 13.5736 15.3769 6.6564 10.8366 6.2600 5.5048 16.8157 9.5561 7.8331 23.4389 2.5333 6.6447 7.8351 3.8212 4.6124 15.0287 45.8356 18.8549 14.8002 20.9828 0.6207 10.3323 2.2950 31.9826 7.5020 4.1219 9.7079 14.5532 20.4006 49.0690 15.4331
temp: 298.150 k
press: 1.00000 atm
elementType: 7 6 6 6 6 6 6 6 6 6 6 6 6 6 6 6 6 6 6 6 6 6 6 6 6 1 1 1 1 1 1 1 1 1 1 1 1 1 1 1
symmnumber: 1
zpe: 816803.8 jmol-1
zpe.correction: 0.311104 hartree
zpe.thermalcorrener: 0.328577 hartree
zpe.thermalcorrenthalpy: 0.329521 hartree
zpe.thermalcorrgfe: 0.266666 hartree
zpe.sumelectzpe: -976.735489 hartree
zpe.sumelectthermal: -976.718016 hartree
zpe.sumelectthermalent: -976.717072 hartree
zpe.sumelectthermalfe: -976.779927 hartree
dipole: -0.3768 2.6840 0.5785
dipole: 2.7714
quadrupole: -114.9605 -131.3522 -150.9495
quadrupole: 4.7925 -0.9367 -0.8909
quadrupole: 17.4602 1.0685 -18.5287 4.7925 -0.9367 -0.8909
hfenergy: -977.0465931 hartree
pointgroup: C01 [X(C24H15N1)]
dipole: -0.1967209 1.0475181 0.2298882 debye
polarizability: 463.1379285|7.8793653|342.0571185|-12.5603781|5.6431369|112.1332208 unknown
InChI: InChI=1S/C24H15N/c1-14-9-11-20-19(13-14)23-18-7-3-2-6-16(18)17-8-4-5-15-10-12-21(25-20)24(23)22(15)17/h2-13H,1H3
charge 0 multiplicity 1
40 atoms
N  1.33831 -2.590805 -0.421559
C  -0.463043 -0.917149 -0.134087
C  0.473156 0.162889 -0.112666
C  -1.881193 -0.686268 0.029713
C  -2.383132 0.647454 0.213732
C  -0.054868 1.533438 -0.198329
C  -1.457801 1.777127 0.036279
C  1.880837 -0.184187 -0.015672
C  0.021956 -2.280324 -0.293724
C  -2.787962 -1.80812 0.064142
C  2.25223 -1.572628 -0.244728
C  -0.927986 -3.374234 -0.329175
C  -3.767289 0.820101 0.489237
C  -2.274205 -3.14835 -0.145212
C  0.761286 2.637602 -0.601763
C  2.929714 0.719327 0.37017
C  -1.933832 3.122348 0.006281
C  -4.165813 -1.586158 0.315766
C  -4.645716 -0.281117 0.541478
C  3.638887 -1.940988 -0.250208
C  4.275873 0.335033 0.413527
C  0.262029 3.946031 -0.652579
C  -1.091021 4.197167 -0.306158
C  4.627242 -1.011038 0.053229
C  5.359463 1.301619 0.854193
H  -0.51628 -4.376326 -0.48009
H  -4.176527 1.819452 0.659642
H  -2.985637 -3.982345 -0.144004
H  1.782991 2.451138 -0.937572
H  2.670363 1.725991 0.708597
H  -2.990563 3.327342 0.197189
H  -4.850263 -2.441686 0.345049
H  -5.707651 -0.116826 0.752949
H  3.87041 -2.988549 -0.465395
H  0.909851 4.766449 -0.979235
H  -1.486586 5.21831 -0.326337
H  5.682606 -1.30954 0.062138
H  5.906306 0.915506 1.735247
H  6.107713 1.454357 0.052831
H  4.943545 2.288256 1.120299
