program: Gaussian 09
title: 000186173
version: EM64L-G09RevD.01
frameworkgroup: C1[X(C10H12ClNOS)]
method: RPBEPBE
basis: SDD
operation: Freq
keyword: #p
keyword: freq=noraman
keyword: PBEPBE/SDD
title: #p freq=noraman PBEPBE/SDD
converged: YES YES NO NO
title: Mulliken charges:
elementType: Cl S O N C C C C C C C C C C H H H H H H H H H H H H
charge: -0.064993 0.106202 -0.264525 -0.099379 0.555872 -0.867780 -0.353638 -0.381500 0.025175 -0.210241 -0.209373 -0.098655 -0.617063 -0.607466 0.272463 0.315025 0.281356 0.237244 0.254238 0.253871 0.230685 0.232242 0.278291 0.260164 0.229098 0.242689
chargesum: 0.00000
title: Mulliken charges with hydrogens summed into heavy atoms:
elementType: Cl S O N C C C C C C C C C C
charge: -0.064993 0.106202 -0.264525 -0.099379 0.555872 -0.280292 -0.072282 -0.144256 0.025175 0.043997 0.044499 -0.098655 0.124154 0.124484
polarizability: 2.07260843e+02 2.28822799e+00 1.37789514e+02 3.18904589e+00 8.74331242e+00 9.92496277e+01
1716.lowfreq: -7.5084 -0.0024 -0.0013 0.0010 3.0554 8.6522 23.9849 36.6259 51.6393
frequency: 23.7916 36.6052 51.5549 75.3558 92.7339 115.6065 145.5165 152.6575 166.9743 239.7588 243.6416 271.5691 325.1151 358.0981 363.8238 388.8575 408.9635 411.2020 457.2484 499.3613 611.9794 613.9201 625.1280 639.1882 655.5779 724.8449 799.7912 830.3582 845.8450 877.3781 892.3427 954.3783 978.2686 1000.1752 1057.2516 1070.8157 1083.9838 1092.5465 1104.4583 1139.4692 1173.1274 1185.8679 1221.0945 1240.8981 1245.3264 1298.8446 1351.4084 1378.1743 1399.3765 1417.8989 1437.3727 1444.8184 1470.9505 1473.6785 1476.9369 1485.0090 1493.0047 1586.1731 1599.2785 1624.2527 2970.8695 2976.3041 3036.5358 3052.6372 3058.3840 3097.4726 3115.0172 3127.3260 3130.3611 3145.6991 3168.2862 3171.7356
redmass: 5.2192 3.9924 4.2436 6.3014 1.2986 4.0953 1.2274 4.2413 5.9652 3.6268 3.0704 4.4657 6.0550 3.5176 2.6571 6.0627 3.0082 4.5463 4.5479 3.7682 10.3067 5.1181 6.7850 6.7918 5.7886 3.4413 4.4650 1.3336 1.5205 1.9953 3.4107 1.3615 1.3535 4.3864 1.3952 2.6897 1.9593 1.2393 1.3604 1.3794 1.0701 1.1268 3.0411 5.4237 1.1910 1.2814 3.2786 7.3863 2.6233 1.1629 1.1538 1.1403 1.0480 1.0509 2.4272 1.0505 1.1301 7.3756 6.1471 7.3518 1.0363 1.0365 1.0587 1.1019 1.0990 1.0997 1.1066 1.0978 1.0899 1.0901 1.0954 1.0967
irintensity: 0.7483 2.1907 0.7673 2.8213 0.5401 2.5243 0.1721 3.4538 1.7607 0.4752 4.6567 1.1078 6.8993 28.1714 4.3816 18.0006 0.2393 2.4584 1.7356 20.8425 9.8074 28.1747 0.2300 26.9821 23.7571 14.7194 34.7784 8.3462 46.3086 7.6399 19.2564 0.3113 1.4399 37.7467 15.6451 48.7416 263.0368 8.7759 12.2843 1.5272 0.4764 1.0017 6.7399 44.9830 7.5922 1.3431 114.4101 0.7466 6.2161 38.7164 13.8265 13.1781 21.5100 19.7034 76.9612 27.9783 17.7502 2.7723 13.5051 270.0387 30.2343 100.5878 16.3719 41.8518 17.7568 18.1975 1.9637 2.0800 10.3200 0.1845 6.2598 2.1012
temp: 298.150 k
press: 1.00000 atm
elementType: 17 16 8 7 6 6 6 6 6 6 6 6 6 6 1 1 1 1 1 1 1 1 1 1 1 1
symmnumber: 1
zpe: 523248.1 jmol-1
zpe.correction: 0.199295 hartree
zpe.thermalcorrener: 0.214402 hartree
zpe.thermalcorrenthalpy: 0.215346 hartree
zpe.thermalcorrgfe: 0.154672 hartree
zpe.sumelectzpe: -1375.327425 hartree
zpe.sumelectthermal: -1375.312317 hartree
zpe.sumelectthermalent: -1375.311373 hartree
zpe.sumelectthermalfe: -1375.372047 hartree
dipole: -3.9994 0.2999 1.5663
dipole: 4.3056
quadrupole: -90.0085 -90.0675 -99.3075
quadrupole: 10.2128 -7.5686 -0.4853
quadrupole: 3.1193 3.0604 -6.1797 10.2128 -7.5686 -0.4853
hfenergy: -1375.5267195 hartree
pointgroup: C01 [X(C10H12Cl1N1O1S1)]
dipole: 1.5408122 0.5455226 0.4447377 debye
dipolederiv: -0.6780068 0.2033779 -0.2931262 0.2644753 -0.1683796 0.1268918 -0.346988 0.1131976 -0.3160741 -0.7709687 0.0645004 0.1161214 0.0023399 -0.1263222 -0.1082402 0.4048648 0.0281839 -0.4867646 -0.7479574 -0.1781762 0.0476803 -0.2459034 -0.8462097 -0.3466203 0.1020488 -0.373336 -0.7113114 -1.1313771 -0.3416647 0.2095538 -0.5139322 -0.616809 -0.0163723 0.4408087 0.0999806 -0.5209079 0.1105751 -0.0382806 0.0618884 -0.0279844 -0.1102555 0.0528919 0.1064414 0.005679 -0.0541577 0.6402372 0.0748166 0.1014903 0.2117733 0.1333663 -0.0766554 0.1747104 -0.0779862 0.1440989 -0.0468653 -0.0651239 -0.0388018 -0.0368579 -0.1054663 0.0035283 -0.0222551 -0.0198258 -0.0051222 -0.0408979 -0.0664882 0.0241724 -0.0686947 -0.1112302 0.0115499 -0.0680779 0.0117895 0.0935374 1.5741956 0.5541418 -0.4857026 0.5889738 0.897415 0.3004729 -0.9402745 0.2374888 0.9343925 -0.3078781 0.0604291 -0.0793981 0.0967944 -0.1297627 0.0415908 -0.0736562 0.0567508 0.0071048 -0.1831024 0.0119573 -0.1605209 0.0394219 -0.105863 0.0713469 -0.2173719 0.0626462 -0.1604833 0.8587693 -0.3686504 0.4348418 -0.4125084 0.0978534 -0.1844438 0.5050202 -0.1767307 0.4117829 0.3407131 -0.0810866 -0.1100131 -0.2070814 0.0710208 -0.0393671 -0.3081512 -0.1432978 0.3359684 0.1899741 0.0487679 0.1640354 0.1492157 0.3135957 0.0306696 0.2783315 0.0752564 0.2074876 -0.0266097 -0.0506694 0.0502538 -0.042629 0.0823164 0.0231567 -0.0223376 0.0824479 -0.0600844 0.010183 0.0274245 -0.0352201 -0.0264063 0.0202679 -0.0026751 -0.0663071 -0.0937673 0.0837649 0.0886439 0.0761681 0.0613308 0.0524056 0.1181853 -0.0137861 0.0616362 0.0030128 0.0742968 0.0999713 0.0313172 -0.0430232 0.019121 0.1283166 0.0031637 -0.0192332 0.0011992 -0.1005619 0.1010485 0.0252714 -0.0110748 0.0290259 0.1492 -0.0034456 -0.0229964 -0.0084455 -0.0497665 -0.001102 0.0699289 0.0570451 0.080996 0.1309846 -0.0287807 0.0499623 -0.0266452 0.0661318 -0.2115372 0.0373825 0.0107036 0.0473117 0.113115 0.0128275 -0.0577706 0.0473454 0.0156205 0.0243599 0.0179814 0.0379542 -0.0293363 -0.0656543 0.1605532 0.1029891 0.1006464 -0.0214752 0.1608409 -0.0639797 -0.0735587 0.0153361 0.0328814 -0.1030631 -0.0126106 -0.044045 0.0861331 -0.006486 0.0749877 0.0703082 0.0817575 0.1180958 -0.0191462 0.0486261 -0.0680191 0.0405971 0.0236193 -0.1090023 0.0147719 -0.1058228 -0.0364866 0.059463 0.0741155 0.1433974 0.0065187 -0.0703427 -0.0153305 -0.1317121 0.0382085 0.0158247 0.0444899 -0.1715248 -0.0369232 -0.0207263 unknown
polarizability: 206.5946516|-5.3873776|97.5706342|6.3179304|0.3210159|140.1346992 unknown
InChI: InChI=1S/C10H12ClNOS/c1-12(2)10(13)14-7-8-3-5-9(11)6-4-8/h3-6H,7H2,1-2H3
charge 0 multiplicity 1
26 atoms
Cl -4.695906 1.001009 -1.694403
S  1.573582 0.137287 1.607444
O  2.234174 -1.256652 -0.687845
N  3.624235 0.557606 -0.191445
C  -1.013416 -0.626438 0.623841
C  0.185322 -1.159755 1.368484
C  -1.050633 -0.669827 -0.795471
C  -2.123668 -0.082574 1.319702
C  2.555778 -0.280482 0.046897
C  -2.166191 -0.176714 -1.506351
C  -3.248447 0.415489 0.624727
C  -3.24828 0.360255 -0.781966
C  4.515905 0.266895 -1.33221
C  4.005821 1.683312 0.675975
H  -0.054827 -1.471552 2.397149
H  0.678578 -1.982429 0.825359
H  -0.194854 -1.085672 -1.338346
H  -2.113924 -0.043665 2.415511
H  -2.194756 -0.212675 -2.599217
H  -4.103997 0.832453 1.163939
H  5.542679 0.056715 -0.976673
H  4.546509 1.130527 -2.02255
H  4.130691 -0.613287 -1.867202
H  3.128925 2.070661 1.219577
H  4.406919 2.500009 0.049681
H  4.779981 1.389804 1.411298
