program: Gaussian 09
title: 000186167
version: EM64L-G09RevD.01
frameworkgroup: C1[X(C14H11BrN2O4)]
method: RPBEPBE
basis: SDD
operation: Freq
keyword: #p
keyword: freq=noraman
keyword: PBEPBE/SDD
title: #p freq=noraman PBEPBE/SDD
converged: YES YES NO NO
title: Mulliken charges:
elementType: Br O O O O N N C C C C C C C C C C C C C C H H H H H H H H H H H
charge: 0.019240 -0.340639 -0.380174 -0.225148 -0.160843 -0.472841 0.019718 0.318858 0.272075 0.140228 0.253228 0.070597 -0.311461 -0.322232 0.258104 -0.313764 -0.845785 -0.188207 -0.236434 -0.343326 -0.258511 0.346385 0.323920 0.255431 0.195165 0.258327 0.234084 0.233059 0.255112 0.298499 0.243545 0.403788
chargesum: 0.00000
title: Mulliken charges with hydrogens summed into heavy atoms:
elementType: Br O O O O N N C C C C C C C C C C C C C C
charge: 0.019240 0.063149 -0.380174 -0.225148 -0.160843 -0.126456 0.019718 0.318858 0.272075 0.140228 0.253228 0.070597 0.012459 -0.066801 0.258104 -0.118598 -0.120315 0.066905 -0.236434 -0.044826 -0.014966
polarizability: 4.11626974e+02 7.83270787e+00 2.06856666e+02 4.42594654e-01 -1.19880934e-02 7.62942649e+01
1716.lowfreq: -37.6082 -6.0073 -1.4246 -0.0011 -0.0009 -0.0009 4.8939 12.3978 22.9636
frequency: -37.6073 12.3869 22.9500 52.1311 56.5322 108.2813 122.6050 145.5019 162.5319 174.8531 183.4367 202.6037 208.1625 262.5748 264.3752 313.6622 344.6733 365.6390 385.2118 411.8640 442.7743 446.7110 458.7852 467.6404 520.4942 526.6164 548.6539 576.4883 585.9857 628.5321 630.4409 654.0607 686.0529 712.3279 724.5313 743.4133 749.1289 800.0895 818.6896 830.7142 846.9015 850.6078 879.0092 900.8775 920.2618 986.3062 986.4942 991.2242 1003.5086 1042.8510 1082.2473 1087.3288 1096.4468 1125.4411 1164.3576 1188.0450 1193.2687 1194.4745 1260.0459 1265.3113 1279.9639 1299.5436 1338.1766 1362.9139 1375.7805 1394.8463 1399.2641 1409.7953 1424.9848 1457.9602 1469.7057 1481.2285 1484.7886 1523.2899 1563.6340 1583.3127 1594.7173 1608.2569 1643.3160 2564.4598 2956.9448 3027.2552 3095.5059 3114.1902 3159.2653 3168.0402 3171.9631 3187.7133 3204.1354 3557.8474
redmass: 14.1748 5.2698 8.5535 7.4518 8.0220 9.0475 4.5899 10.7195 9.9168 2.2296 3.6116 1.3765 5.0858 5.4358 6.2359 9.1333 4.7245 8.8306 10.4046 4.7478 3.3696 5.9034 5.2368 5.8886 2.8628 5.3328 3.2373 7.0145 6.7521 2.1528 2.7673 7.5177 8.8981 7.1976 3.7060 2.1801 7.5881 2.3877 5.9618 6.8546 1.3617 5.9555 1.3390 7.3550 1.4032 1.2995 1.5286 1.3464 1.0815 1.5173 2.8270 2.7762 2.1080 2.2392 2.5769 1.2661 5.3909 1.7014 2.3563 1.9226 3.4139 2.0833 2.5192 7.9883 6.5712 2.9793 1.3927 3.1653 3.2794 1.8229 2.6388 1.5477 1.0511 2.0548 5.5785 4.6909 3.8763 4.8840 3.4294 1.0754 1.0405 1.0983 1.0943 1.0891 1.0926 1.0908 1.0915 1.0969 1.0949 1.0747
irintensity: 0.4856 0.8803 0.0058 0.9692 0.8160 2.0042 0.5102 0.1147 1.5800 2.2143 0.2211 0.2799 0.1988 0.5485 0.2318 17.1263 0.8186 7.2468 0.6708 21.4952 8.0681 1.3656 0.4920 36.5267 0.1021 0.0596 22.1251 11.9677 10.8952 21.6723 17.3516 8.0155 61.7481 8.6037 0.0324 71.9919 0.9149 15.5487 5.5949 20.0430 45.1134 48.8018 12.7082 86.9610 1.4928 3.9446 4.8838 1.4143 146.4568 8.3279 20.9876 6.9057 20.6814 2.7231 147.5153 51.5836 311.3954 19.2050 11.1081 16.8428 27.9278 39.1637 307.2347 33.3441 53.5179 64.3607 40.0245 111.8785 84.9057 0.6989 254.6637 262.6823 24.6424 486.3300 169.6986 18.0640 31.3779 60.7558 75.9444 949.6649 24.4082 18.1684 15.5027 21.6684 4.2691 7.9752 1.5810 8.3319 11.6138 28.1106
temp: 298.150 k
press: 1.00000 atm
elementType: 35 8 8 8 8 7 7 6 6 6 6 6 6 6 6 6 6 6 6 6 6 1 1 1 1 1 1 1 1 1 1 1
symmnumber: 1
zpe: 594065.0 jmol-1
zpe.correction: 0.226267 hartree
zpe.thermalcorrener: 0.244158 hartree
zpe.thermalcorrenthalpy: 0.245103 hartree
zpe.thermalcorrgfe: 0.177344 hartree
zpe.sumelectzpe: -962.401664 hartree
zpe.sumelectthermal: -962.383773 hartree
zpe.sumelectthermalent: -962.382829 hartree
zpe.sumelectthermalfe: -962.450587 hartree
dipole: -4.9701 7.4829 -0.1372
dipole: 8.9841
quadrupole: -186.3069 -120.4392 -133.6342
quadrupole: 19.8976 -1.2593 0.3322
quadrupole: -39.5134 26.3542 13.1592 19.8976 -1.2593 0.3322
hfenergy: -962.6279313 hartree
pointgroup: C01 [X(C14H11Br1N2O4)]
dipole: 2.0363522 -2.8087372 -0.6766621 debye
polarizability: 409.655608|17.3957681|203.900721|-18.1655439|21.389142|81.2215765 unknown
InChI: InChI=1S/C14H11BrN2O4/c1-8-7-9(15)5-6-11(8)16-14(19)10-3-2-4-12(13(10)18)17(20)21/h2-7,16,18H,1H3
charge 0 multiplicity 1
32 atoms
Br 7.128107 0.947631 -0.232443
O  -2.36813 1.885361 0.552606
O  0.080551 1.628898 0.297067
O  -6.184012 0.04468 0.505648
O  -5.011297 1.978273 0.763397
N  1.087658 -0.438423 -0.096656
N  -5.07166 0.716371 0.531888
C  2.466118 -0.067223 -0.116133
C  3.414633 -1.121595 -0.31225
C  -1.372459 -0.287938 0.041013
C  -0.025183 0.353751 0.085016
C  -2.523907 0.561875 0.29864
C  2.90349 1.272903 0.044352
C  4.788842 -0.796065 -0.343394
C  -3.823154 -0.048118 0.275234
C  -1.571027 -1.662111 -0.240299
C  2.974979 -2.566618 -0.48698
C  4.280042 1.577425 0.010089
C  5.210463 0.539605 -0.183634
C  -3.977808 -1.422009 -0.000857
C  -2.856812 -2.231996 -0.262841
H  0.915795 -1.435019 -0.230713
H  2.166798 2.062167 0.195665
H  5.526093 -1.590375 -0.492773
H  -0.723001 -2.322533 -0.459881
H  3.848356 -3.226029 -0.612758
H  2.416349 -2.943817 0.393423
H  2.340291 -2.704627 -1.385831
H  4.612153 2.611664 0.134047
H  -4.993287 -1.826437 -0.006147
H  -2.986587 -3.294564 -0.484458
H  -1.337495 2.087594 0.499962
