program: Gaussian 09
title: 000015959
version: EM64L-G09RevD.01
frameworkgroup: C1[X(C11H11N3O)]
method: RPBEPBE
basis: SDD
operation: Freq
keyword: #p
keyword: freq=noraman
keyword: PBEPBE/SDD
title: #p freq=noraman PBEPBE/SDD
converged: YES YES NO NO
title: Mulliken charges:
elementType: O N N N C C C C C C C C C C C H H H H H H H H H H H
charge: -0.168477 -0.438929 -0.019978 -0.062916 0.200502 -0.493267 0.162386 0.300377 -0.663863 -0.333023 -0.349531 -0.143088 -0.224092 -0.242390 -0.222552 0.215034 0.270524 0.324224 0.237833 0.198013 0.248497 0.295300 0.198989 0.239129 0.233493 0.237805
chargesum: 0.00000
title: Mulliken charges with hydrogens summed into heavy atoms:
elementType: O N N N C C C C C C C C C C C
charge: -0.168477 -0.114704 -0.019978 -0.062916 0.200502 -0.007709 0.162386 0.300377 0.020480 -0.037723 -0.150542 -0.143088 0.015037 -0.008896 0.015252
polarizability: 2.02027966e+02 1.36214400e+01 1.65961453e+02 -1.13293289e+00 4.20415348e+00 6.82091677e+01
1716.lowfreq: -11.9589 -6.2901 -4.1237 -0.0010 -0.0008 -0.0005 21.7793 31.8075 53.8181
frequency: 21.6194 31.7354 53.7269 82.2037 107.0409 138.8494 192.1457 229.8460 270.5567 288.7937 339.5973 368.1086 400.2285 461.0423 514.1416 556.8324 579.0951 614.2456 630.9174 649.9793 671.7886 692.5707 703.1631 773.3804 784.4821 798.2928 823.5458 849.3590 853.8406 933.7254 961.2838 976.7586 987.1138 988.2895 1000.4984 1013.3450 1028.8996 1059.3026 1083.9371 1093.3651 1136.4419 1176.1304 1194.1271 1219.9989 1265.3650 1310.0969 1319.0168 1328.6805 1372.6095 1387.9233 1396.6551 1438.2498 1462.9430 1476.0786 1481.0929 1484.7943 1548.4880 1587.4387 1596.8521 1612.8268 1630.0738 2987.3573 2989.4988 3075.1375 3098.2014 3104.7260 3108.9710 3136.6870 3150.2252 3163.7929 3174.6447 3548.7358
redmass: 2.4988 3.8471 4.6523 6.7682 4.4985 4.0170 1.2840 5.0587 2.9314 5.2453 3.4925 5.5618 2.7798 3.7965 5.9077 8.5180 5.2993 6.0849 1.3148 4.6365 5.2370 2.8742 1.9842 2.5832 1.6294 3.8698 5.0563 1.2743 4.8205 1.4343 4.1212 4.9194 1.7382 3.0808 2.6412 1.3576 2.1322 2.1499 1.6134 1.9873 3.2860 1.0588 1.1261 1.5861 1.4790 1.6819 1.4074 2.7087 3.2615 8.6770 1.2043 2.2849 1.0789 1.0617 1.8618 1.1881 4.1356 5.3733 8.3205 6.1079 11.6949 1.0467 1.0569 1.0972 1.0984 1.0987 1.0886 1.0869 1.0920 1.0961 1.1001 1.0780
irintensity: 0.3326 0.9143 7.2687 0.1329 3.5584 1.8022 1.0290 1.3845 0.1162 0.3475 1.4945 2.4490 0.1470 5.3708 0.9709 1.2057 1.0598 1.4093 49.3906 12.2959 4.0840 22.6145 75.4159 35.0411 23.6009 1.6240 7.1930 1.1031 11.3949 3.0149 36.5599 33.0359 1.6988 1.9119 5.9545 3.2622 24.0757 16.4036 14.8597 15.2439 39.9753 1.3920 9.0661 58.6308 27.2054 17.5741 2.6911 12.3466 177.9074 1.4983 11.3328 46.4580 8.2341 19.4628 8.1524 22.7134 410.6318 189.2668 423.3272 21.9588 43.6793 30.6655 15.7813 21.0886 28.7788 19.9761 17.6621 1.1872 19.8870 10.9781 18.9249 25.2549
temp: 298.150 k
press: 1.00000 atm
elementType: 8 7 7 7 6 6 6 6 6 6 6 6 6 6 6 1 1 1 1 1 1 1 1 1 1 1
symmnumber: 1
zpe: 529775.3 jmol-1
zpe.correction: 0.201781 hartree
zpe.thermalcorrener: 0.215005 hartree
zpe.thermalcorrenthalpy: 0.215949 hartree
zpe.thermalcorrgfe: 0.159562 hartree
zpe.sumelectzpe: -664.186700 hartree
zpe.sumelectthermal: -664.173476 hartree
zpe.sumelectthermalent: -664.172532 hartree
zpe.sumelectthermalfe: -664.228919 hartree
dipole: -3.9351 -8.7006 -1.2620
dipole: 9.6322
quadrupole: -81.0982 -95.3473 -89.5475
quadrupole: -17.0811 -1.6070 -0.7971
quadrupole: 7.5661 -6.6830 -0.8832 -17.0811 -1.6070 -0.7971
hfenergy: -664.3884807 hartree
pointgroup: C01 [X(C11H11N3O1)]
dipole: -1.5911616 -3.4377701 -0.1045837 debye
dipolederiv: -0.6635351 -0.2609805 0.021755 -0.3644154 -1.1539455 0.03083 -0.0013425 -0.0053771 -0.3546192 -1.3772941 0.0947244 0.0779657 0.2166251 -0.7478165 -0.0500346 0.1085492 -0.0676645 -0.1699152 -0.6223898 0.1834866 0.040099 0.1010252 -1.1574749 -0.0061694 0.0428158 -0.0358144 -0.2447149 -1.2807719 -0.4971296 0.0372652 -0.4865366 -0.8098998 0.0067829 0.0995356 0.0371387 -0.2489285 1.1449244 0.1044566 0.0061906 -0.0290799 0.9613252 0.0150843 -0.0403517 0.0680728 0.0465777 -0.0066674 0.0503257 0.0268946 0.1654505 -0.134728 0.060777 -0.0314472 0.1127238 0.0594563 1.5018995 0.0206055 -0.118673 0.0776033 0.9555589 0.1048496 -0.191855 0.0741076 0.1599114 -0.4436856 -0.0312264 0.0199226 -0.0807751 -0.0424538 0.0066733 0.0409781 0.0082302 -0.0346221 0.0454873 0.0493618 -0.0046789 0.04114 0.0223666 0.0168582 0.0739237 -0.0616794 0.0206095 -0.0374873 0.101735 -0.0204988 -0.1013792 0.0021148 -0.0164096 -0.028889 -0.0090099 -0.0894178 0.1003672 -0.0557882 0.0172474 0.1085534 0.0125369 -0.0365497 0.043392 -0.0341959 -0.1495641 1.4477926 0.3505973 -0.0936469 0.3990493 1.7565496 -0.0485265 -0.0801186 -0.0259157 0.2840192 0.0165098 -0.1720969 0.0181652 -0.1788976 0.0274931 -0.0155192 0.0186546 -0.0112167 -0.1453327 -0.2393314 0.0484721 -0.0075496 0.1815578 0.1185387 -0.0464404 -0.0198053 -0.0435114 -0.1373574 0.1174055 0.0277928 -0.0166734 -0.0580716 -0.0239847 -0.0141361 -0.001059 -0.0180321 -0.1344031 0.0497009 -0.0255622 -0.1007099 0.0145352 -0.0082234 -0.0902394 -0.0485111 -0.0774399 -0.0713901 -0.0340199 -0.0152697 0.0438388 -0.0791203 0.0611692 0.0428948 0.0211084 0.0262123 0.0763669 0.274573 -0.0521551 0.0039427 -0.0323297 0.1290387 -0.0252009 -0.00453 -0.0213651 0.3029894 -0.0148599 0.1418626 0.0103723 0.1573087 -0.0841307 0.0124386 0.0047548 0.0122661 0.0782932 -0.1312541 -0.1076858 0.0590097 -0.0854178 0.0672747 0.041077 0.0182784 0.0217604 0.0465175 0.0950963 -0.0331013 -0.0451446 -0.0665328 0.0350957 -0.1031919 -0.0439505 -0.0492884 -0.0529005 0.1577003 -0.0480233 0.0120612 -0.0217061 0.0334528 0.0226963 0.0217919 0.0146541 0.1506585 -0.0213148 0.1332588 -0.0121237 0.1349802 -0.0125576 0.021043 -0.0262539 0.0152012 0.1409983 -0.0163662 0.082434 -0.0034707 0.1074726 -0.011864 0.0187533 -0.0054428 0.0205357 0.1547338 0.0504735 -0.0517687 0.01155 -0.0812305 -0.0846602 0.0395593 0.0127118 0.0396042 0.1540983 -0.1129529 -0.0383252 0.0168895 -0.0398089 0.0892246 0.0121002 0.0170622 0.0100036 0.1579356 unknown
polarizability: 202.046849|12.852113|165.5255082|-6.6365331|-5.9318763|68.6262289 unknown
InChI: InChI=1S/C11H11N3O/c1-2-9-12-10(14-11(15)13-9)8-6-4-3-5-7-8/h3-7,12H,2H2,1H3
charge 0 multiplicity 1
26 atoms
O  2.256145 3.043234 -0.245982
N  0.936798 -0.736463 -0.398357
N  2.791326 0.755959 -0.295529
N  0.451439 1.561917 -0.047298
C  2.316601 -0.469435 -0.409397
C  3.241791 -1.660224 -0.530118
C  0.031814 0.311051 -0.162266
C  -1.414774 -0.013081 -0.045619
C  3.277605 -2.51926 0.762384
C  -2.347619 1.054017 -0.138345
C  -1.890903 -1.336115 0.161818
C  1.853888 1.858536 -0.201987
C  -3.729384 0.80028 -0.039342
C  -3.276191 -1.586822 0.261267
C  -4.199206 -0.520746 0.156472
H  2.937935 -2.287403 -1.392412
H  4.245196 -1.260216 -0.743922
H  0.60308 -1.689228 -0.548367
H  3.991047 -3.352795 0.642715
H  2.289601 -2.952907 1.005324
H  3.603653 -1.909008 1.622041
H  -1.95548 2.065397 -0.282179
H  -1.200091 -2.179775 0.287414
H  -4.440769 1.629286 -0.115302
H  -3.634093 -2.608074 0.42951
H  -5.274111 -0.717425 0.232678
