program: Gaussian 09
title: 000186166
version: EM64L-G09RevD.01
frameworkgroup: C1[X(C17H17N3O5)]
method: RPBEPBE
basis: SDD
operation: Freq
keyword: #p
keyword: freq=noraman
keyword: PBEPBE/SDD
title: #p freq=noraman PBEPBE/SDD
converged: YES YES NO NO
title: Mulliken charges:
elementType: O O O O O N N N C C C C C C C C C C C C C C C C C H H H H H H H H H H H H H H H H H
charge: -0.229676 -0.193356 -0.177950 -0.178257 -0.183285 -0.497472 0.019482 0.022855 0.121655 0.425696 0.399479 -0.559561 -0.570601 -0.436181 -0.425990 -0.236970 0.114600 -0.683302 -0.671127 0.363287 -0.499315 -0.521573 0.418187 0.425201 -0.500070 0.271871 0.215308 0.230574 0.222503 0.237508 0.239237 0.313756 0.229900 0.224242 0.223707 0.213911 0.194346 0.230997 0.237226 0.336183 0.292119 0.340855
chargesum: 0.00000
title: Mulliken charges with hydrogens summed into heavy atoms:
elementType: O O O O O N N N C C C C C C C C C C C C C C C C C
charge: -0.229676 -0.193356 -0.177950 -0.178257 -0.183285 -0.183716 0.019482 0.022855 0.121655 0.425696 0.399479 -0.072381 -0.117525 -0.198673 -0.186753 -0.007071 0.114600 -0.021442 -0.008557 0.363287 -0.163132 -0.229453 0.418187 0.425201 -0.159214
polarizability: 3.32615728e+02 -5.76597796e+00 2.17462570e+02 1.55008529e+00 -1.45794907e+00 1.69122348e+02
1716.lowfreq: -5.4197 -1.4930 -0.0003 0.0002 0.0007 5.1354 13.4327 25.4961 35.7011
frequency: 13.1818 25.3803 35.6898 48.1003 52.7223 58.7135 65.3486 83.4063 93.5211 115.8900 129.3236 142.9832 160.8320 180.4805 186.1179 194.9915 202.7328 211.5007 233.5003 290.5847 304.3324 331.3788 337.7958 346.8945 354.9880 375.1407 442.0136 458.7043 464.0041 485.9039 507.0554 516.3571 533.6540 538.6016 578.0411 605.4814 620.9692 638.3482 658.5487 683.5917 699.0367 705.6584 724.6023 738.4767 745.9470 772.6584 787.8817 791.8261 808.3458 843.2211 867.0133 875.8732 912.5669 920.0447 949.7840 967.2649 971.5309 981.9850 983.6694 986.8481 1003.6403 1033.5772 1056.2951 1064.9016 1073.4449 1085.6544 1096.2627 1108.4493 1131.0049 1178.7155 1203.6819 1206.4756 1218.3549 1232.8073 1238.7192 1246.8216 1258.4887 1263.5464 1280.9549 1316.4443 1325.3582 1375.5997 1379.4935 1383.7757 1384.3410 1393.4007 1397.7651 1433.7609 1440.3242 1456.1150 1460.4865 1465.9851 1472.5621 1474.3846 1483.5516 1487.6414 1492.2673 1501.5756 1580.3127 1597.4590 1602.7335 1611.8421 1617.1281 2971.5747 2982.0665 2992.6803 3002.9009 3041.6382 3053.5356 3066.1139 3079.2241 3085.4459 3088.6551 3123.0667 3132.0050 3158.1287 3163.0975 3178.5518 3193.7567 3515.8985
redmass: 5.5886 5.4625 4.6705 14.2147 14.1698 3.8749 4.0715 3.2723 4.0077 5.7291 6.3661 5.7719 3.1752 3.2228 1.4486 4.5816 1.2414 3.0897 4.4316 3.4535 6.7813 8.6855 3.2115 3.0163 7.0851 4.5944 5.4153 3.1691 5.6222 5.9931 7.1462 4.6477 4.3726 2.8746 4.4401 1.4857 3.8983 5.8040 5.0230 12.1435 2.7697 7.0116 8.8706 5.3033 4.1396 1.6280 1.4888 1.5573 1.6827 4.0650 10.4867 3.3496 1.3555 5.7310 1.5598 2.3906 1.4964 1.3485 1.5082 5.1875 2.4268 1.8321 1.9865 1.9318 1.4090 1.7162 1.6227 1.6569 3.6190 1.1762 5.5785 11.1720 4.0389 1.3857 1.3406 1.4887 2.3328 1.6704 1.6308 1.4963 1.6752 5.4363 9.9802 1.6781 2.9410 1.2137 5.4936 4.0047 2.5779 2.9503 2.7560 1.1552 1.0530 1.2797 1.0682 1.1059 1.6310 1.1080 7.2229 6.3847 6.1973 7.6614 8.1856 1.0382 1.0348 1.0615 1.0618 1.0973 1.0992 1.0984 1.0995 1.1010 1.1010 1.0860 1.0918 1.0993 1.0920 1.0925 1.0930 1.0759
irintensity: 0.0754 0.0388 0.3854 0.0059 0.0178 1.2238 0.5409 0.0722 7.4455 5.5809 5.6225 3.2620 0.3409 0.7172 0.5365 0.1536 0.2867 1.5336 1.3366 1.1138 4.5085 0.2380 0.6114 0.4391 3.4746 8.7209 1.2696 2.0853 0.1217 10.9263 0.8801 1.3635 4.8422 13.3389 3.0306 49.6360 1.3810 15.7361 9.3816 38.9697 40.6832 24.7399 0.1614 6.6823 19.6380 12.5626 6.1394 4.2234 33.3303 3.9808 19.2311 10.9974 0.3992 9.1631 8.9180 0.2060 26.0959 0.6277 12.8822 0.5211 0.5236 0.7203 5.8422 10.4160 69.7061 4.6336 31.1980 6.7893 31.0328 3.0470 103.4540 263.7959 154.7428 0.4968 1.0621 3.7939 2.5414 0.9852 25.6520 2.2785 0.5880 9.8973 57.4934 58.0044 73.1633 17.6843 3.4773 29.5391 93.7897 101.7413 23.8279 14.4533 6.3802 19.6418 13.3214 19.1978 126.2611 30.7560 14.8322 10.7949 7.2605 81.2268 19.4212 27.1270 34.1800 25.0939 26.4477 4.7578 0.7278 81.4633 44.1451 43.7202 34.5533 0.5659 21.0556 33.4345 4.7133 15.0964 29.3336 28.6122
temp: 298.150 k
press: 1.00000 atm
elementType: 8 8 8 8 8 7 7 7 6 6 6 6 6 6 6 6 6 6 6 6 6 6 6 6 6 1 1 1 1 1 1 1 1 1 1 1 1 1 1 1 1 1
symmnumber: 1
zpe: 833112.2 jmol-1
zpe.correction: 0.317316 hartree
zpe.thermalcorrener: 0.340930 hartree
zpe.thermalcorrenthalpy: 0.341875 hartree
zpe.thermalcorrgfe: 0.261221 hartree
zpe.sumelectzpe: -1196.430006 hartree
zpe.sumelectthermal: -1196.406392 hartree
zpe.sumelectthermalent: -1196.405447 hartree
zpe.sumelectthermalfe: -1196.486101 hartree
dipole: 5.2872 2.3489 -0.8497
dipole: 5.8475
quadrupole: -158.8641 -173.2499 -137.3404
quadrupole: 1.8249 -3.1823 -10.2119
quadrupole: -2.3793 -16.7651 19.1444 1.8249 -3.1823 -10.2119
hfenergy: -1196.7473218 hartree
pointgroup: C01 [X(C17H17N3O5)]
dipole: -2.0730803 0.2269226 0.9713764 debye
polarizability: 332.536965|6.0627924|184.8568854|3.2157266|22.6718956|201.806796 unknown
InChI: InChI=1S/C17H17N3O5/c1-3-11-6-5-7-12(4-2)16(11)18-17(21)13-8-14(19(22)23)10-15(9-13)20(24)25/h5-10,18H,3-4H2,1-2H3
charge 0 multiplicity 1
42 atoms
O  -0.671176 -1.07489 -1.840132
O  2.173144 2.881359 2.239414
O  4.047315 -2.507652 -2.079009
O  4.37992 2.364257 1.97106
O  5.656625 -1.301987 -0.999118
N  -1.38273 -0.055073 0.151529
N  3.129274 2.180644 1.729724
N  4.429112 -1.5675 -1.287364
C  -2.811134 -0.232159 0.00867
C  -3.514642 0.335595 -1.094011
C  -3.484227 -0.959834 1.035535
C  -2.844159 1.193996 -2.157506
C  -2.732608 -1.545284 2.225271
C  -4.914909 0.12289 -1.158229
C  -4.885645 -1.126126 0.937114
C  -5.600574 -0.595737 -0.156987
C  -0.417443 -0.476205 -0.752405
C  -2.41813 2.593139 -1.635219
C  -2.495826 -0.517417 3.367297
C  1.016843 -0.17897 -0.35828
C  2.023619 -0.970174 -0.963713
C  1.386971 0.861162 0.525241
C  2.753916 1.077136 0.799532
C  3.372705 -0.721658 -0.654791
C  3.775337 0.299085 0.227977
H  -1.969829 0.666861 -2.577604
H  -3.555902 1.333579 -2.992291
H  -3.315659 -2.389679 2.63538
H  -1.762562 -1.966647 1.89809
H  -5.469953 0.541827 -2.005686
H  -5.410968 -1.69106 1.716194
H  -1.062298 0.239318 1.077106
H  -6.683509 -0.742934 -0.230645
H  -3.289011 3.156817 -1.254742
H  -1.955663 3.183122 -2.447304
H  -1.68251 2.512027 -0.814789
H  -1.900426 0.356448 3.036122
H  -1.958793 -0.984735 4.212237
H  -3.457146 -0.12461 3.742765
H  1.742693 -1.754295 -1.673035
H  0.657968 1.536945 0.98273
H  4.829484 0.48132 0.450676
