program: Gaussian 09
title: 000186138
version: EM64L-G09RevD.01
frameworkgroup: C1[X(C12H15Cl2NO3)]
method: RPBEPBE
basis: SDD
operation: Freq
keyword: #p
keyword: freq=noraman
keyword: PBEPBE/SDD
title: #p freq=noraman PBEPBE/SDD
converged: YES YES NO NO
title: Mulliken charges:
elementType: Cl Cl O O O N C C C C C C C C C C C C H H H H H H H H H H H H H H H
charge: -0.042257 -0.032387 -0.484382 -0.436454 -0.272815 -0.464738 0.351534 -0.138946 -0.786330 -0.724066 -0.363957 0.162069 0.308790 -0.331743 -0.343361 -0.090541 -0.076363 -0.220240 0.285790 0.234539 0.255380 0.208195 0.216406 0.216885 0.268821 0.318588 0.206465 0.221290 0.358814 0.354401 0.304900 0.247983 0.287728
chargesum: 0.00000
title: Mulliken charges with hydrogens summed into heavy atoms:
elementType: Cl Cl O O O N C C C C C C C C C C C C
charge: -0.042257 -0.032387 -0.125568 -0.082053 -0.272815 -0.146150 0.351534 0.146845 -0.088215 -0.021953 0.063798 0.162069 0.308790 -0.026843 -0.095379 -0.090541 -0.076363 0.067488
polarizability: 2.25152444e+02 -2.46743032e+00 1.81818324e+02 -1.01938063e+01 5.96686761e-01 1.03998815e+02
1716.lowfreq: -8.5045 -4.0484 -0.0023 -0.0013 -0.0008 3.7802 14.7064 30.2086 50.9717
frequency: 13.9277 30.1954 50.9655 68.7440 88.0987 100.1012 117.9190 151.9471 169.8747 178.0947 200.2982 204.1592 211.7752 230.9366 245.5477 262.9163 284.1749 307.4427 330.1035 334.5598 342.6563 380.6098 385.7924 410.2411 448.5595 483.9174 503.7479 511.8456 517.2161 531.4767 563.1651 581.2098 661.9872 711.4447 735.9053 754.7473 786.6492 855.2738 869.2420 875.0625 884.9192 914.4497 926.4826 933.8111 957.5768 980.5269 987.2016 1007.9276 1027.4188 1045.3982 1094.1995 1107.3203 1134.5445 1162.0045 1163.7716 1197.8251 1218.4001 1248.0572 1256.9739 1277.2501 1306.6424 1324.8974 1374.7201 1376.6648 1379.4245 1388.4662 1399.1788 1402.2945 1419.4921 1460.2815 1462.9436 1467.9138 1478.4608 1490.3293 1496.8425 1556.5813 1592.2788 1596.0378 2969.6098 2984.6415 2993.3549 3023.9685 3076.5897 3086.1948 3094.3767 3102.7269 3106.8552 3156.6608 3177.4024 3186.5445 3518.4464 3539.1853 3590.9826
redmass: 6.6190 7.6972 3.9738 6.0202 6.4330 3.1619 9.1707 8.1349 3.5474 3.9659 3.5307 2.0917 2.8687 5.3156 1.4140 1.4674 1.2466 2.7453 3.2296 5.0323 6.9030 5.6123 3.9854 7.7177 4.7326 3.6862 1.2964 2.4941 4.7479 4.1158 1.2855 3.3156 2.8855 6.9575 4.5326 9.8604 3.6737 2.7157 1.6736 1.5248 3.7573 2.2206 1.4603 1.6100 2.3818 5.9504 3.0896 1.5885 2.2396 1.9676 1.4830 1.6672 3.9100 2.1466 1.2092 3.1208 2.3665 1.3874 1.2429 2.0701 1.5882 1.3354 1.2071 10.2873 1.2115 1.3431 1.2437 2.8275 2.6612 1.0957 1.1797 1.0905 1.2081 1.1559 1.1878 7.0737 6.9656 7.7070 1.0675 1.0377 1.0360 1.0848 1.0983 1.0990 1.0960 1.0992 1.1002 1.0919 1.0929 1.0940 1.0648 1.0770 1.0662
irintensity: 1.0923 0.1799 0.6891 2.1364 0.7031 5.3306 1.7855 2.6118 5.6078 1.6699 0.9143 2.1055 11.8992 0.1157 5.3267 1.4207 146.3550 8.6908 6.1232 7.3197 2.0952 16.2837 0.5013 3.7056 4.9000 16.9573 148.7576 27.9692 1.4464 2.4414 49.7956 10.2366 12.3970 24.1746 35.5892 84.6647 21.4979 37.6901 25.4636 3.2440 2.1974 7.5262 16.6502 3.2370 50.0394 1.1524 44.4183 14.7629 66.9118 7.8709 6.0904 3.1776 35.1116 17.1554 23.3387 16.9916 20.2201 123.1194 26.6554 163.8362 9.4542 23.9058 17.9724 0.1956 39.3870 20.5221 44.4987 42.3976 40.6285 11.2793 85.7372 21.6650 103.8361 26.1926 115.7933 207.7147 19.8153 45.6487 47.8192 24.7831 25.8904 9.5442 9.3926 43.5026 23.6102 17.7682 15.6699 2.2205 6.6062 1.3988 11.2127 14.6064 7.0019
temp: 298.150 k
press: 1.00000 atm
elementType: 17 17 8 8 8 7 6 6 6 6 6 6 6 6 6 6 6 6 1 1 1 1 1 1 1 1 1 1 1 1 1 1 1
symmnumber: 1
zpe: 661532.4 jmol-1
zpe.correction: 0.251964 hartree
zpe.thermalcorrener: 0.271446 hartree
zpe.thermalcorrenthalpy: 0.272391 hartree
zpe.thermalcorrgfe: 0.202415 hartree
zpe.sumelectzpe: -1665.457062 hartree
zpe.sumelectthermal: -1665.437580 hartree
zpe.sumelectthermalent: -1665.436636 hartree
zpe.sumelectthermalfe: -1665.506611 hartree
dipole: 1.2229 3.1423 2.7795
dipole: 4.3698
quadrupole: -138.4532 -128.4924 -119.5226
quadrupole: -6.1650 -12.9807 -1.7119
quadrupole: -9.6305 0.3303 9.3001 -6.1650 -12.9807 -1.7119
hfenergy: -1665.7090267 hartree
pointgroup: C01 [X(C12H15Cl2N1O3)]
dipole: -0.487244 -1.1970446 1.133755 debye
polarizability: 224.9344685|-1.8188408|181.6443338|11.6126987|-3.4680994|104.3907814 unknown
InChI: InChI=1S/C12H15Cl2NO3/c1-12(2,10(17)6-16)15-11(18)7-3-8(13)5-9(14)4-7/h3-5,10,15-17H,6H2,1-2H3
charge 0 multiplicity 1
33 atoms
Cl -3.780008 -3.128208 -0.146575
Cl -4.900341 2.307912 -0.307444
O  2.806965 -0.9640 -1.403063
O  5.138511 0.471647 -1.731148
O  0.456017 1.760895 -0.195676
N  0.919912 -0.348289 0.697943
C  2.391216 -0.166299 0.942295
C  3.081918 0.123695 -0.433841
C  2.888763 -1.496984 1.552581
C  2.61927 1.0131 1.922134
C  4.617535 0.193097 -0.392989
C  0.067866 0.60616 0.174414
C  -1.391357 0.207804 0.058339
C  -2.328879 1.264234 -0.056624
C  -1.83378 -1.140395 0.029063
C  -3.211549 -1.399518 -0.095221
C  -3.693532 0.955518 -0.173098
C  -4.169295 -0.372046 -0.193089
H  2.687856 1.080646 -0.826787
H  3.932557 -1.401141 1.893214
H  2.84247 -2.309357 0.805683
H  2.28237 -1.771892 2.436715
H  2.060686 0.839962 2.859262
H  3.689756 1.103513 2.176447
H  2.275143 1.962996 1.481115
H  0.513832 -1.210839 1.065674
H  5.033288 -0.760417 -0.006349
H  4.961054 1.026358 0.239749
H  1.879676 -0.872328 -1.734228
H  4.686551 -0.171421 -2.339949
H  -1.96269 2.294459 -0.062867
H  -1.136109 -1.982966 0.061285
H  -5.234571 -0.594797 -0.289167
