program: Gaussian 09
title: 000186137
version: EM64L-G09RevD.01
frameworkgroup: C1[X(C12H13Cl2NO2)]
method: RPBEPBE
basis: SDD
operation: Freq
keyword: #p
keyword: freq=noraman
keyword: PBEPBE/SDD
title: #p freq=noraman PBEPBE/SDD
converged: YES YES NO NO
title: Mulliken charges:
elementType: Cl Cl O O N C C C C C C C C C C C C H H H H H H H H H H H H H
charge: -0.043714 -0.044380 -0.287829 -0.437071 -0.118693 0.181739 -0.123987 -0.710170 -0.756410 -0.366702 0.105953 0.326217 -0.354485 -0.332752 -0.067175 -0.063746 -0.222133 0.257632 0.237092 0.215086 0.234687 0.225216 0.205123 0.252017 0.249283 0.203056 0.352887 0.300820 0.297062 0.285376
chargesum: 0.00000
title: Mulliken charges with hydrogens summed into heavy atoms:
elementType: Cl Cl O O N C C C C C C C C C C C C
charge: -0.043714 -0.044380 -0.287829 -0.084185 -0.118693 0.181739 0.133645 -0.023305 -0.074053 0.085638 0.105953 0.326217 -0.053666 -0.035689 -0.067175 -0.063746 0.063243
polarizability: 2.29970910e+02 -8.98837555e+00 1.81026584e+02 6.59180078e+00 5.46665990e+00 9.19739170e+01
1716.lowfreq: -8.4032 -5.1938 -2.2642 0.0004 0.0020 0.0022 22.3584 45.0416 64.8455
frequency: 22.1440 45.0283 64.8449 76.8666 129.5202 142.2810 157.1844 191.0956 202.6316 218.4272 228.0958 231.8049 251.0859 266.4750 269.8892 329.8196 333.4970 373.9756 383.5329 402.1524 408.4170 436.2408 483.8629 517.4373 519.3924 544.6398 608.2264 653.8807 699.2576 730.1958 752.1795 753.4294 841.4324 864.9577 869.7424 901.5753 911.9357 920.1769 932.3091 955.4333 970.9305 979.6180 990.1243 1001.7027 1049.0409 1092.1241 1094.9409 1105.5834 1124.9900 1169.3388 1195.4710 1223.2042 1249.7466 1253.3041 1282.1888 1308.2186 1341.9001 1369.6109 1374.4842 1378.5386 1393.1967 1406.0830 1433.1839 1456.2542 1464.7246 1472.4127 1480.8656 1493.1480 1560.5852 1590.8656 1614.6422 2980.7673 2981.5738 2984.5912 3070.3061 3076.9282 3083.0623 3089.7966 3094.7027 3098.3603 3182.4501 3185.7300 3189.6009 3579.6965
redmass: 5.6454 7.0016 5.3346 5.6870 4.3681 5.6379 14.7849 4.4738 4.5911 1.3106 2.5114 2.4606 2.1234 6.7418 1.5347 1.2187 2.6892 7.8528 3.8531 3.2932 7.9759 4.4308 3.8980 5.4041 4.6522 4.0611 4.4755 3.9487 3.5311 5.7855 3.5656 10.1463 3.5991 7.9211 1.4547 7.2242 1.4312 1.4187 1.5990 2.1041 2.4032 6.3796 1.4755 1.7986 3.9647 2.3776 1.6345 2.0543 1.3636 2.1259 2.2854 2.0908 1.2079 1.6677 3.6912 1.3931 1.2704 1.2388 1.2098 9.7644 1.2187 3.0099 3.8028 1.0494 1.0619 1.0638 1.0599 1.0519 7.6261 9.1445 8.9534 1.0659 1.0375 1.0357 1.0876 1.1000 1.1001 1.0980 1.0975 1.0993 1.0932 1.0938 1.0938 1.0660
irintensity: 0.1843 0.0026 0.5375 0.7203 2.9128 1.8043 0.8708 0.4045 0.0104 5.9277 9.9446 4.3221 13.3528 0.0295 10.5881 116.8114 15.0209 3.7581 1.1349 6.5980 6.1481 0.4560 6.4599 0.4089 6.1558 6.2896 2.5488 3.5059 25.2394 23.6612 12.4227 100.9438 25.0261 9.3613 27.8187 89.9807 13.3605 11.3103 2.2711 22.3588 134.9222 1.8491 1.2299 5.9684 22.8424 0.6421 8.3479 5.4600 23.5100 62.4592 15.5025 3.3008 2.1756 31.6757 138.9303 11.1445 9.8458 13.7861 23.0779 1.3788 12.5417 61.2421 43.6493 2.0245 0.5356 9.1048 13.9376 15.4561 147.9662 98.4946 14.7219 30.1588 32.0749 23.7894 9.3360 23.8660 40.4102 13.7583 8.5406 31.8303 3.7356 1.6847 1.6358 5.9870
temp: 298.150 k
press: 1.00000 atm
elementType: 17 17 8 8 7 6 6 6 6 6 6 6 6 6 6 6 6 1 1 1 1 1 1 1 1 1 1 1 1 1
symmnumber: 1
zpe: 593010.8 jmol-1
zpe.correction: 0.225866 hartree
zpe.thermalcorrener: 0.242857 hartree
zpe.thermalcorrenthalpy: 0.243801 hartree
zpe.thermalcorrgfe: 0.180102 hartree
zpe.sumelectzpe: -1589.116673 hartree
zpe.sumelectthermal: -1589.099682 hartree
zpe.sumelectthermalent: -1589.098738 hartree
zpe.sumelectthermalfe: -1589.162436 hartree
dipole: 2.2857 -1.2422 0.0938
dipole: 2.6032
quadrupole: -111.8647 -122.0004 -113.5663
quadrupole: -10.2935 1.2990 0.6371
quadrupole: 3.9458 -6.1899 2.2441 -10.2935 1.2990 0.6371
hfenergy: -1589.3425387 hartree
pointgroup: C01 [X(C12H13Cl2N1O2)]
dipole: -0.9001608 -0.4764331 0.1078315 debye
polarizability: 230.0605307|10.1959429|170.7559653|3.1073487|-28.9516783|102.1549153 unknown
InChI: InChI=1S/C12H13Cl2NO2/c1-12(2)10(6-16)17-11(15-12)7-3-8(13)5-9(14)4-7/h3-5,10,16H,6H2,1-2H3
charge 0 multiplicity 1
30 atoms
Cl 3.868724 2.638467 -1.015778
Cl 4.071516 -2.446944 1.201113
O  -1.190524 0.913097 -0.695448
O  -4.584524 1.683154 0.701311
N  -1.238114 -1.216678 0.24881
C  -2.674214 -0.91472 -0.129407
C  -2.657193 0.630442 -0.46412
C  -2.998723 -1.736093 -1.402764
C  -3.600285 -1.339052 1.027444
C  -3.121132 1.619485 0.622665
C  -0.511913 -0.199785 -0.134332
C  0.956663 -0.091048 -0.062521
C  1.701722 -1.179076 0.463985
C  1.610959 1.083075 -0.515879
C  3.012958 1.141907 -0.433213
C  3.098618 -1.064712 0.526797
C  3.787035 0.084999 0.084481
H  -3.180369 0.853798 -1.408447
H  -2.834045 -2.810583 -1.212943
H  -4.052622 -1.585481 -1.701063
H  -2.349096 -1.432157 -2.243031
H  -3.410113 -0.759403 1.948687
H  -4.664962 -1.252689 0.740584
H  -3.402787 -2.397739 1.267092
H  -2.806348 2.632942 0.327066
H  -2.657292 1.38192 1.602196
H  -4.925195 0.886401 1.179141
H  1.177382 -2.074864 0.805992
H  1.028136 1.913817 -0.919624
H  4.875943 0.151923 0.140905
