program: Gaussian 09
title: 000015953
version: EM64L-G09RevD.01
frameworkgroup: C1[X(C5H12O3S)]
method: RPBEPBE
basis: SDD
operation: Freq
keyword: #p
keyword: freq=noraman
keyword: PBEPBE/SDD
title: #p freq=noraman PBEPBE/SDD
converged: NO YES NO NO
title: Mulliken charges:
elementType: S O O O C C C C C H H H H H H H H H H H H
charge: 1.054480 -0.419468 -0.519333 -0.519201 -0.356802 -0.348055 -0.257169 -0.679753 -0.731876 0.212249 0.212301 0.199670 0.199672 0.224724 0.224804 0.212377 0.212368 0.220655 0.288578 0.281244 0.288534
chargesum: 0.00000
title: Mulliken charges with hydrogens summed into heavy atoms:
elementType: S O O O C C C C C
charge: 1.054480 -0.419468 -0.519333 -0.519201 0.067749 0.051287 0.192359 -0.034353 0.126480
polarizability: 1.25859818e+02 1.65948904e+00 8.13826210e+01 1.20549994e-02 2.80498268e-03 8.07092444e+01
1716.lowfreq: -9.0555 -4.1412 -0.0013 -0.0013 -0.0009 6.5630 18.4875 44.0886 72.0658
frequency: 16.2446 43.0760 72.0631 97.3728 111.5250 152.7185 161.7949 194.0992 217.6311 226.1472 297.7250 303.8825 344.6621 370.3076 436.4062 558.0886 603.2742 747.9014 814.2618 833.7993 889.7524 909.4428 920.5135 943.7495 998.6422 1031.4311 1038.0485 1074.3402 1112.4024 1146.3583 1210.2457 1275.0103 1275.3335 1287.9172 1315.9513 1345.1615 1360.5305 1390.2851 1416.0632 1419.0358 1470.4712 1474.7911 1475.9793 1483.2194 1492.0682 2976.0131 2977.8432 2980.2683 3000.2086 3021.2776 3040.4578 3042.5921 3067.6123 3078.1620 3079.7717 3191.7839 3199.1016
redmass: 6.9735 1.9418 4.1059 2.4327 1.8962 1.0284 4.1204 3.7591 3.6377 1.2212 7.7412 5.0368 5.0410 7.4925 3.7300 8.8368 9.0845 1.0727 1.1270 11.2720 2.4077 2.9282 3.4057 1.1529 1.3846 3.6717 1.9378 2.4225 2.5363 1.4026 1.3856 1.1658 1.2784 1.0782 1.1344 1.4053 1.3745 1.2101 1.0515 1.0505 1.0732 1.0584 1.0422 1.0707 1.0919 1.0539 1.0403 1.0557 1.0584 1.1006 1.1066 1.0248 1.1051 1.0994 1.1034 1.1078 1.1076
irintensity: 1.9113 2.8956 6.4921 0.9529 0.4363 0.0382 5.8373 1.1546 1.5891 0.2826 10.4416 5.3430 25.3212 25.4071 7.4519 55.5655 64.9897 9.9432 0.0079 65.8706 34.7872 35.7288 58.3917 0.3969 42.0144 4.0136 70.6777 1.1480 36.8934 2.2275 0.0020 0.1997 2.7576 0.2128 3.9916 0.5668 12.2787 7.3462 12.8192 11.8971 3.9441 0.0096 13.3374 12.5763 21.6369 22.8958 20.1290 43.1675 46.2124 5.9791 0.9323 0.0322 2.1802 46.0182 115.5591 0.1161 0.0043
temp: 298.150 k
press: 1.00000 atm
elementType: 16 8 8 8 6 6 6 6 6 1 1 1 1 1 1 1 1 1 1 1 1
symmnumber: 1
zpe: 442706.9 jmol-1
zpe.correction: 0.168618 hartree
zpe.thermalcorrener: 0.181245 hartree
zpe.thermalcorrenthalpy: 0.182189 hartree
zpe.thermalcorrgfe: 0.127782 hartree
zpe.sumelectzpe: -820.524957 hartree
zpe.sumelectthermal: -820.512330 hartree
zpe.sumelectthermalent: -820.511386 hartree
zpe.sumelectthermalfe: -820.565793 hartree
dipole: -1.4940 3.3644 -0.0096
dipole: 3.6812
quadrupole: -55.8952 -63.5508 -69.4046
quadrupole: 12.7523 -0.0343 -0.0194
quadrupole: 7.0550 -0.6006 -6.4544 12.7523 -0.0343 -0.0194
hfenergy: -820.6935749 hartree
pointgroup: C01 [X(C5H12O3S1)]
dipole: 0.5855688 -1.3246087 -0.010738 debye
dipolederiv: 1.8128773 0.0138921 0.000282 -0.2446655 1.3270478 -0.0000822 -0.0011815 0.000072 1.3411318 -1.1178285 -0.0850199 -0.001113 -0.0285745 -0.5012761 -0.0003386 -0.0007442 -0.0004151 -0.4425276 -0.6210327 -0.0054232 -0.0348563 0.0628554 -0.5530455 0.0376443 -0.1420655 0.1065451 -0.6295671 -0.6216778 -0.005468 0.0351822 0.0609967 -0.5508985 -0.0364449 0.1432773 -0.1054055 -0.6311634 -0.1637903 -0.0149358 -0.0002938 -0.3841536 0.0586295 -0.0009734 -0.001548 -0.0004492 0.1635119 0.0732772 0.0253816 0.0000022 0.2784752 0.0989862 0.0000794 0.0006724 -0.0001976 0.176892 0.5551141 0.1156983 0.0007506 0.6251676 0.2763908 0.0005866 0.0033501 -0.0000691 0.3207936 -0.1019128 0.0347402 -0.0000463 -0.092948 0.0530909 -0.0002571 -0.0003979 -0.0001242 0.097137 -0.1509602 -0.0078777 -0.000019 -0.0250597 -0.1630486 -0.0004899 -0.0002922 -0.0004329 -0.1078926 0.0753752 -0.0019819 0.005052 0.012222 -0.0177176 -0.0998221 0.0070557 -0.1192684 -0.0642294 0.0749533 -0.002016 -0.0048677 0.0123224 -0.0192391 0.1001581 -0.0069734 0.1196168 -0.0628008 0.0260497 0.0249912 0.0319231 -0.009535 -0.0368742 -0.1164732 0.0024561 -0.1466927 -0.0822079 0.0261818 0.0251088 -0.0316697 -0.0095446 -0.0386419 0.1167452 -0.0024348 0.1470005 -0.0804422 -0.0060927 -0.0001625 0.0244967 -0.0955759 -0.0176474 -0.0723054 -0.0110615 -0.1098334 -0.0591616 -0.0060652 -0.0002816 -0.0243066 -0.0958988 -0.0192304 0.0724173 0.010383 0.1100948 -0.0574351 0.0832484 0.0045294 0.0189204 0.0557305 -0.011832 0.1205125 -0.0309165 0.1350125 -0.0838123 0.0832153 0.0047744 -0.0187188 0.0556228 -0.0101636 -0.1199797 0.0314243 -0.1345262 -0.085471 -0.1779817 -0.1004309 -0.0004882 -0.1146881 -0.0019468 -0.0003838 -0.000483 -0.0003957 0.1027147 0.0894555 -0.0191507 -0.0349699 -0.017876 0.0352575 0.0435202 -0.0499806 0.0269556 0.0307557 -0.0215163 0.0132473 -0.0001424 -0.0263328 0.0558876 -0.0005529 -0.0004334 -0.0005096 0.1238559 0.0891102 -0.019615 0.0348825 -0.0185399 0.0362715 -0.0435602 0.0498935 -0.0269777 0.0299186 unknown
polarizability: 125.8652459|1.5845821|81.3771652|0.0416617|0.0025921|80.7092726 unknown
InChI: InChI=1S/C5H12O3S/c1-3-4-5-8-9(2,6)7/h3-5H2,1-2H3
charge 0 multiplicity 1
21 atoms
S  -2.159672 0.170302 -0.001408
O  -0.461772 -0.603624 -0.003557
O  -2.404977 0.956356 -1.397636
O  -2.411531 0.93528 1.405273
C  1.936461 -0.41984 0.000671
C  3.182909 0.499789 0.004331
C  0.636991 0.396439 0.002596
C  4.499333 -0.306982 0.002218
C  -3.05282 -1.501636 -0.015746
H  1.954177 -1.073118 -0.892308
H  1.953196 -1.078955 0.889369
H  3.153312 1.159006 0.89486
H  3.15407 1.164992 -0.881741
H  0.563191 1.02526 0.911098
H  0.565642 1.033616 -0.900261
H  4.567582 -0.95829 0.893409
H  4.56838 -0.952443 -0.893162
H  5.378183 0.362985 0.004813
H  -2.729989 -2.023835 0.8937
H  -4.126625 -1.270635 -0.015824
H  -2.726842 -2.009966 -0.931895
