program: Gaussian 09
title: 000186139
version: EM64L-G09RevD.01
frameworkgroup: C1[X(C12H13Cl2NO3)]
method: RPBEPBE
basis: SDD
operation: Freq
keyword: #p
keyword: freq=noraman
keyword: PBEPBE/SDD
title: #p freq=noraman PBEPBE/SDD
converged: YES YES NO NO
title: Mulliken charges:
elementType: Cl Cl O O O N C C C C C C C C C C C C H H H H H H H H H H H H H
charge: -0.048322 -0.042715 -0.408188 -0.281614 -0.259111 -0.414751 0.322825 -0.522375 -0.699575 -0.769909 0.157161 0.192480 0.320531 -0.364220 -0.357189 -0.085585 -0.068954 -0.221088 0.258031 0.306266 0.219221 0.204993 0.272209 0.227123 0.248032 0.226895 0.332938 0.296346 0.293418 0.379836 0.285289
chargesum: 0.00000
title: Mulliken charges with hydrogens summed into heavy atoms:
elementType: Cl Cl O O O N C C C C C C C C C C C C
charge: -0.048322 -0.042715 -0.028352 -0.281614 -0.259111 -0.081813 0.322825 0.041922 -0.003152 -0.067859 0.157161 0.192480 0.320531 -0.067874 -0.063770 -0.085585 -0.068954 0.064202
polarizability: 2.13948153e+02 8.62863999e-01 1.81415089e+02 -4.58461140e+00 1.15502265e+01 1.04978531e+02
1716.lowfreq: -7.1715 -5.1496 -3.6716 0.0016 0.0022 0.0023 17.7796 27.7002 41.5468
frequency: 17.6654 27.6922 41.5254 56.2760 76.4749 111.6950 139.6394 156.7205 169.4728 181.0802 199.7219 204.4471 224.5548 239.0371 265.2696 293.3044 326.1329 332.9369 342.0700 376.0207 385.6379 407.8142 433.4575 453.6136 496.6679 514.5365 520.2112 559.2500 560.4040 617.5387 654.5999 667.6088 707.5028 734.9182 756.5675 804.4241 856.4108 869.6092 883.4366 893.4003 907.7461 909.2867 928.6428 940.4171 980.5887 988.1295 1020.0370 1053.6409 1093.1804 1109.8059 1137.5647 1148.8704 1186.3210 1228.2574 1253.3548 1259.5529 1265.3307 1296.6300 1352.1643 1373.7780 1374.9766 1394.9004 1403.2335 1423.7661 1430.2405 1456.3947 1475.4304 1479.2481 1490.8262 1501.2128 1557.5749 1592.9903 1594.4332 1649.1939 2986.7690 2989.9054 2992.5672 3066.0787 3083.6695 3088.0486 3094.7077 3112.9565 3149.4081 3179.7168 3185.1516 3505.8228 3545.4756
redmass: 8.8203 8.5664 9.5928 6.4350 8.0629 6.5986 3.6166 11.1606 5.1755 3.9773 5.0887 4.6995 1.0536 4.9308 1.0811 3.5084 4.6397 2.8480 7.1267 7.0826 4.2597 7.9635 2.6680 4.3626 2.8592 2.2586 5.3048 1.2508 4.4852 3.6830 1.4810 3.0164 6.9815 5.1683 8.9518 3.8690 3.6402 1.4612 4.6903 2.0278 1.8579 1.4249 2.0570 1.6803 5.1023 1.8609 1.4040 2.1942 1.4904 1.7682 3.2021 1.7484 2.1663 2.5717 1.5081 1.9160 1.4415 2.7619 1.9713 9.3798 1.2091 1.2434 2.9358 2.6524 1.0932 1.1390 1.0992 1.0581 1.5456 1.1347 6.8655 6.4696 7.5396 7.8378 1.0357 1.0521 1.0482 1.0953 1.1002 1.0997 1.0993 1.1003 1.0935 1.0930 1.0940 1.0639 1.0774
irintensity: 0.1933 0.5764 0.9565 2.4548 2.0391 10.6578 1.8741 1.2164 2.0093 0.3693 4.6288 0.3661 0.0040 0.3461 0.2239 5.2933 10.7316 2.8831 2.1510 10.4699 1.4346 5.2576 1.0070 8.8666 18.4959 30.3886 0.4227 112.0496 13.5274 18.4661 111.7911 13.6183 33.2422 46.6389 74.0585 25.2060 0.9879 27.9808 0.8873 22.2838 0.2811 3.0097 7.8985 6.7901 4.9349 1.6572 3.7204 301.5335 7.2591 4.5021 42.2935 4.0988 4.2474 20.2313 84.4784 32.9324 37.4146 128.1095 108.8663 0.7132 35.1101 40.8299 41.0080 28.3747 36.7869 58.4869 43.5160 4.7982 275.2445 28.8757 170.7852 34.8277 33.4791 207.5355 12.9936 22.7606 29.9836 2.9830 4.5293 32.5555 40.5852 7.1990 2.5158 3.4035 0.7707 25.9011 18.4434
temp: 298.150 k
press: 1.00000 atm
elementType: 17 17 8 8 8 7 6 6 6 6 6 6 6 6 6 6 6 6 1 1 1 1 1 1 1 1 1 1 1 1 1
symmnumber: 1
zpe: 602902.0 jmol-1
zpe.correction: 0.229633 hartree
zpe.thermalcorrener: 0.248238 hartree
zpe.thermalcorrenthalpy: 0.249182 hartree
zpe.thermalcorrgfe: 0.180732 hartree
zpe.sumelectzpe: -1664.316542 hartree
zpe.sumelectthermal: -1664.297938 hartree
zpe.sumelectthermalent: -1664.296994 hartree
zpe.sumelectthermalfe: -1664.365443 hartree
dipole: -3.4115 1.2813 1.8119
dipole: 4.0697
quadrupole: -110.3895 -125.3082 -118.3716
quadrupole: -0.9674 -2.2283 -7.1234
quadrupole: 7.6336 -7.2851 -0.3485 -0.9674 -2.2283 -7.1234
hfenergy: -1664.5461754 hartree
pointgroup: C01 [X(C12H13Cl2N1O3)]
dipole: 1.3228303 0.4682143 -0.7711095 debye
polarizability: 213.1597463|-2.3374909|181.7105339|-10.0342725|-10.5770539|105.4714922 unknown
InChI: InChI=1S/C12H13Cl2NO3/c1-12(2,6-10(16)17)15-11(18)7-3-8(13)5-9(14)4-7/h3-5,15-16H,6H2,1-2H3
charge 0 multiplicity 1
31 atoms
Cl -2.853151 3.351203 -0.417333
Cl -5.035849 -1.640589 0.653901
O  3.874108 1.393151 1.859733
O  0.452831 -1.99288 0.786805
O  2.184148 1.885056 0.357543
N  1.078093 -0.507153 -0.91119
C  2.541814 -0.799999 -0.929839
C  3.158132 -0.409407 0.448225
C  2.788715 -2.309902 -1.181808
C  3.160054 0.029453 -2.080348
C  0.181077 -1.030387 -0.00348
C  2.989503 1.047675 0.831368
C  -1.184914 -0.379213 -0.003722
C  -2.307771 -1.193902 0.281516
C  -1.341459 1.015548 -0.215421
C  -2.638077 1.560122 -0.165129
C  -3.580781 -0.60188 0.311337
C  -3.780632 0.776338 0.087149
H  4.233777 -0.657988 0.474022
H  2.674578 -1.02206 1.235485
H  2.342999 -2.607501 -2.147082
H  3.874494 -2.512885 -1.222231
H  2.334708 -2.91916 -0.384461
H  2.737997 -0.287488 -3.051135
H  2.977122 1.110713 -1.948471
H  4.250783 -0.135096 -2.117632
H  0.77445 0.289327 -1.474213
H  -2.160989 -2.257923 0.484523
H  -0.473578 1.66936 -0.353233
H  3.716367 2.340589 2.125197
H  -4.77885 1.219073 0.120418
