program: Gaussian 09
title: 000186140
version: EM64L-G09RevD.01
frameworkgroup: C1[X(C12H13Cl2NO4)]
method: RPBEPBE
basis: SDD
operation: Freq
keyword: #p
keyword: freq=noraman
keyword: PBEPBE/SDD
title: #p freq=noraman PBEPBE/SDD
converged: YES YES NO NO
title: Mulliken charges:
elementType: Cl Cl O O O O N C C C C C C C C C C C C H H H H H H H H H H H H H
charge: -0.046792 -0.037016 -0.462000 -0.395091 -0.276641 -0.249194 -0.431277 0.319465 -0.166096 -0.707334 -0.779787 0.195528 0.121053 0.306625 -0.335217 -0.359756 -0.080332 -0.073115 -0.221087 0.315590 0.265678 0.258465 0.207725 0.217844 0.229816 0.259341 0.316658 0.366476 0.302967 0.260424 0.390432 0.286649
chargesum: 0.00000
title: Mulliken charges with hydrogens summed into heavy atoms:
elementType: Cl Cl O O O O N C C C C C C C C C C C C
charge: -0.046792 -0.037016 -0.095524 -0.004659 -0.276641 -0.249194 -0.114619 0.319465 0.149494 0.024534 -0.072786 0.195528 0.121053 0.306625 -0.032250 -0.099332 -0.080332 -0.073115 0.065561
polarizability: 2.25556371e+02 -8.18450450e+00 1.76716603e+02 1.30554879e+01 7.82295833e+00 1.16458014e+02
1716.lowfreq: -9.9945 -4.3847 -0.0001 0.0012 0.0022 5.3087 13.7767 25.7039 32.4762
frequency: 13.1524 25.6855 32.4413 62.7106 66.2320 107.6999 119.4033 149.6413 166.7200 181.0023 196.9134 203.0797 209.9178 222.3416 244.1124 262.3756 282.2615 308.0719 331.4654 341.9056 378.7365 384.6218 396.6138 408.4355 423.0788 441.7789 474.9308 506.6731 518.8563 541.1097 571.0568 575.6748 635.2262 663.2618 666.4484 717.9572 736.9404 755.1561 798.8648 865.8931 871.4966 878.8853 888.9934 914.1672 924.6749 938.1343 974.4346 982.0818 1011.6322 1018.4975 1083.3078 1093.7292 1105.6342 1135.8950 1156.7659 1196.7735 1212.5154 1242.1490 1252.8777 1269.6708 1292.0917 1313.6587 1370.9734 1376.6595 1390.5287 1394.8567 1402.9401 1421.6747 1456.0713 1467.0770 1482.9763 1490.5422 1494.9685 1557.5309 1593.9690 1596.8952 1624.1976 2978.0569 3001.8804 3018.3679 3070.6245 3102.6180 3108.2144 3123.0054 3159.7786 3178.4740 3185.8117 3462.8404 3497.0627 3543.6785
redmass: 7.9525 8.5024 8.4166 7.2674 10.2143 6.3884 9.2798 7.5309 5.0551 6.1360 3.1806 4.7440 1.2749 2.7644 2.6507 1.4840 3.5549 3.8332 4.1420 7.2201 5.4654 2.4799 1.7837 7.1554 3.4549 4.0722 3.5684 3.0275 5.0656 1.5029 3.4724 2.4794 2.5094 2.8394 2.5816 6.2671 4.9117 9.0172 4.1842 3.7664 1.5492 2.0549 2.6401 2.3089 1.5477 1.5213 2.3890 4.9162 1.5742 3.6642 2.3527 1.4781 1.6801 3.9204 2.1366 2.3151 3.0926 1.3732 1.2490 1.7293 1.7903 1.8086 1.2010 10.4567 1.3442 1.4501 2.8779 2.7748 1.0989 1.1001 1.0587 1.7434 1.0590 7.0507 7.0095 7.5828 8.1050 1.0393 1.0361 1.0839 1.0973 1.0992 1.0983 1.1004 1.0923 1.0929 1.0940 1.0651 1.0639 1.0770
irintensity: 0.3742 0.4795 0.8843 2.4588 1.9911 4.3294 5.1096 1.0691 0.2613 0.7806 0.8999 0.5322 0.3460 3.1971 8.2257 0.1302 7.2272 26.4587 13.3518 5.5222 20.2339 21.6971 43.7933 5.4526 30.5812 10.3365 6.2237 14.6034 1.8338 68.7493 13.2662 56.8518 42.6654 22.3994 50.2695 23.7585 47.0442 77.8971 6.3259 26.5688 30.8042 5.3994 2.5340 12.0509 15.2501 3.4562 26.8871 0.2630 38.3757 166.7320 66.1465 6.0193 2.8078 26.3176 7.4149 42.1451 15.6880 36.4592 26.2573 274.3415 91.3743 34.3254 35.2250 0.2118 25.8537 32.2244 43.7171 27.5742 35.6863 30.8183 19.7141 289.2930 22.4182 187.8969 20.9778 53.7271 253.0650 18.9080 20.6190 10.8383 29.1130 9.3327 13.6249 7.2943 0.9358 5.6119 1.1484 48.2463 30.9621 13.6003
temp: 298.150 k
press: 1.00000 atm
elementType: 17 17 8 8 8 8 7 6 6 6 6 6 6 6 6 6 6 6 6 1 1 1 1 1 1 1 1 1 1 1 1 1
symmnumber: 1
zpe: 611882.6 jmol-1
zpe.correction: 0.233054 hartree
zpe.thermalcorrener: 0.252853 hartree
zpe.thermalcorrenthalpy: 0.253797 hartree
zpe.thermalcorrgfe: 0.182468 hartree
zpe.sumelectzpe: -1739.446180 hartree
zpe.sumelectthermal: -1739.426381 hartree
zpe.sumelectthermalent: -1739.425437 hartree
zpe.sumelectthermalfe: -1739.496766 hartree
dipole: 0.1573 2.9286 2.7708
dipole: 4.0347
quadrupole: -137.2516 -126.7513 -126.2272
quadrupole: -6.4940 -1.3152 -5.1613
quadrupole: -7.1749 3.3254 3.8495 -6.4940 -1.3152 -5.1613
hfenergy: -1739.679234 hartree
pointgroup: C01 [X(C12H13Cl2N1O4)]
dipole: 0.0489239 0.9080496 1.301095 debye
polarizability: 224.4607282|-12.2241795|171.6674278|14.0547253|18.5263848|122.6028318 unknown
InChI: InChI=1S/C12H13Cl2NO4/c1-12(2,9(16)11(18)19)15-10(17)6-3-7(13)5-8(14)4-6/h3-5,9,15-16,18H,1-2H3
charge 0 multiplicity 1
32 atoms
Cl 4.098323 2.677511 1.271396
Cl 4.612136 -2.597305 -0.385733
O  -4.433604 -0.374614 -0.674902
O  -1.737457 -1.16582 1.697246
O  -0.359636 -0.918951 -1.706801
O  -4.041973 -1.014866 1.915287
N  -0.871895 0.817246 -0.226856
C  -2.324702 0.920948 -0.530744
C  -3.042628 -0.469904 -0.254557
C  -2.536195 1.277007 -2.02305
C  -2.919664 2.020011 0.375087
C  0.00045 -0.069486 -0.830037
C  -3.009036 -0.899469 1.208363
C  1.441532 0.012069 -0.375799
C  2.238788 -1.14442 -0.561663
C  2.00848 1.186586 0.182642
C  3.362702 1.168503 0.564448
C  3.584239 -1.113681 -0.161987
C  4.177948 0.030825 0.410211
H  -2.522759 -1.227831 -0.870648
H  -2.056854 0.530166 -2.675894
H  -3.615068 1.299114 -2.243473
H  -2.097693 2.268849 -2.232374
H  -2.741307 1.820198 1.449816
H  -2.484395 3.003621 0.124535
H  -4.00822 2.076132 0.213104
H  -0.549167 1.302408 0.612144
H  -5.006407 -0.535009 0.12534
H  1.788509 -2.027473 -1.023015
H  1.432572 2.111811 0.278747
H  -1.802786 -1.479978 2.641017
H  5.228066 0.037601 0.711648
