program: Gaussian 09
title: 000186185
version: EM64L-G09RevD.01
frameworkgroup: C1[X(C16H14Cl6O4)]
method: RPBEPBE
basis: SDD
operation: Freq
keyword: #p
keyword: freq=noraman
keyword: PBEPBE/SDD
title: #p freq=noraman PBEPBE/SDD
converged: YES YES NO NO
title: Mulliken charges:
elementType: Cl Cl Cl Cl Cl Cl O O O O C C C C C C C C C C C C C C C C H H H H H H H H H H H H H H
charge: 0.001780 0.000044 0.079080 0.055631 0.062707 0.061103 -0.242125 -0.304054 -0.247174 -0.233783 -0.050532 -0.044789 -0.188899 -0.201174 -0.262217 -0.265296 -0.460813 -0.063757 -0.151957 -0.516748 -0.056409 -0.047263 0.302407 0.334547 -0.762609 -0.764857 0.272952 0.325173 0.314275 0.310660 0.265771 0.364757 0.273121 0.314579 0.254686 0.260445 0.247561 0.245812 0.268295 0.249071
chargesum: 0.00000
title: Mulliken charges with hydrogens summed into heavy atoms:
elementType: Cl Cl Cl Cl Cl Cl O O O O C C C C C C C C C C C C C C C C
charge: 0.001780 0.000044 0.079080 0.055631 0.062707 0.061103 -0.242125 -0.304054 -0.247174 -0.233783 0.222420 0.280383 0.125376 0.109485 -0.262217 -0.265296 -0.460813 0.202014 0.212800 0.070952 -0.056409 -0.047263 0.302407 0.334547 0.000084 -0.001679
polarizability: 2.63115259e+02 -7.89937738e+00 2.29402699e+02 -5.95813841e+00 -3.53726655e+00 2.01572410e+02
1716.lowfreq: -1.5673 -0.0022 -0.0012 0.0007 2.9116 8.1889 20.2708 32.8713 47.1074
frequency: 20.2049 32.8493 47.1004 50.0423 55.2663 66.4338 74.6317 79.3049 91.6573 98.4196 100.3671 108.5076 126.6570 130.9916 146.1903 155.1208 159.7286 185.6453 193.1370 208.1951 227.9093 233.8890 261.7169 285.3813 292.5706 318.3168 340.9633 350.3047 358.7836 370.0239 397.5045 415.9264 426.5072 445.3366 460.8510 510.1148 549.3789 553.2989 558.1860 565.8169 580.8704 593.0433 616.5303 641.0959 669.4524 720.8494 760.6579 771.7503 782.6505 812.3567 826.9659 839.0201 850.0792 865.9910 901.8157 924.1418 936.4284 961.9046 966.2337 980.2251 992.4775 997.1694 1003.4080 1026.5549 1032.5927 1040.4751 1043.4402 1043.9380 1045.5294 1071.2245 1075.4836 1087.6368 1101.8847 1109.7614 1158.8150 1170.3995 1177.1012 1185.6794 1189.4876 1197.8383 1214.8640 1225.3967 1239.8549 1269.8588 1272.8978 1288.5742 1327.5679 1358.4885 1371.4260 1383.2532 1386.8375 1401.0026 1452.3277 1453.1730 1453.6606 1455.4218 1482.0106 1589.8204 1650.1373 1677.0631 3006.8713 3007.0894 3022.7650 3043.4713 3045.4911 3052.2813 3081.9326 3100.9575 3101.0378 3121.4494 3129.1109 3142.9831 3143.1166 3144.0194
redmass: 6.7820 9.0401 4.2033 1.4760 2.2906 6.3953 5.2660 7.2843 10.8842 9.0390 1.1932 26.8182 24.4744 11.8296 13.3334 30.8301 25.7543 15.1901 10.6547 7.4476 11.4434 7.4332 10.3948 6.1113 6.5626 13.1666 7.9545 11.2949 7.9530 5.0332 4.3452 5.9428 5.9346 3.9432 4.9072 4.5289 4.5115 3.9169 4.2396 3.5170 6.0880 9.3297 5.3024 4.8433 6.0574 5.5781 5.3528 5.7767 5.9517 6.2080 4.6518 6.0397 4.1638 5.6884 5.3643 3.6414 3.4164 3.5666 4.0631 2.5566 2.7673 2.1957 2.7245 3.9871 4.5947 2.9024 1.7398 1.7846 2.4958 3.1414 2.2591 2.3750 3.1472 3.0183 1.9582 1.5693 1.8908 1.9559 2.2832 2.8819 2.0507 1.5473 1.4484 1.5002 1.5498 1.3636 1.2468 1.2391 1.2327 1.2423 1.2314 1.1808 1.0549 1.0548 1.0559 1.0524 1.0971 11.7132 10.0248 10.1890 1.0389 1.0379 1.0852 1.0835 1.0787 1.0685 1.0851 1.0939 1.0943 1.0892 1.0918 1.1027 1.1021 1.1076
irintensity: 3.5014 0.0374 0.6129 0.7748 3.7826 1.2924 0.5169 0.9900 0.1994 0.4174 0.1598 0.1353 0.5967 0.6263 1.3355 0.0778 0.0730 0.9414 1.2091 4.0800 1.3095 1.7125 1.4570 6.3539 11.7605 1.2340 6.4827 6.3281 15.7218 9.7444 2.6647 16.6234 4.8050 1.6388 17.7896 0.7283 10.6463 1.7523 5.0067 4.6206 15.5711 13.1437 13.1763 5.1457 17.9962 6.0107 44.2331 43.8823 46.8797 0.4907 0.4781 102.5065 17.8051 9.4416 1.7578 77.9482 45.6139 36.2365 45.9410 38.7102 72.6671 22.5417 33.6970 86.7979 23.1903 36.2961 5.2987 8.9832 63.9267 36.8871 10.1656 31.4607 5.8209 4.0677 78.1817 10.9983 41.5829 54.8106 271.2755 299.0584 1.4327 4.3593 23.8858 42.9464 12.9519 3.8803 6.8612 7.7524 5.5187 67.5651 55.4117 6.2550 22.5054 19.0900 21.1061 12.5105 15.0696 49.5760 171.6051 179.3933 0.6259 0.7335 7.6180 2.8486 14.6313 13.0524 8.1445 12.0860 0.7066 1.2223 0.5136 3.5501 12.1462 6.6897
temp: 298.150 k
press: 1.00000 atm
elementType: 17 17 17 17 17 17 8 8 8 8 6 6 6 6 6 6 6 6 6 6 6 6 6 6 6 6 1 1 1 1 1 1 1 1 1 1 1 1 1 1
symmnumber: 1
zpe: 711194.3 jmol-1
zpe.correction: 0.270880 hartree
zpe.thermalcorrener: 0.297260 hartree
zpe.thermalcorrenthalpy: 0.298204 hartree
zpe.thermalcorrgfe: 0.211978 hartree
zpe.sumelectzpe: -3677.369606 hartree
zpe.sumelectthermal: -3677.343226 hartree
zpe.sumelectthermalent: -3677.342282 hartree
zpe.sumelectthermalfe: -3677.428508 hartree
dipole: -1.8097 0.7805 2.7022
dipole: 3.3446
quadrupole: -198.7914 -185.9196 -197.0362
quadrupole: 5.8093 -3.4893 3.2628
quadrupole: -4.8756 7.9961 -3.1205 5.8093 -3.4893 3.2628
hfenergy: -3677.6404859 hartree
pointgroup: C01[X(C16H14Cl6O4)]
dipole: -0.6727192 -0.2981744 -1.0908789 debye
polarizability: 260.7160267|11.193295|232.1088157|7.1317219|-0.1316659|201.2655261 unknown
InChI: InChI=1S/C16H14Cl6O4/c1-4(23)25-10-8-6-7(9(16(8,21)22)11(10)26-5(2)24)15(20)3-14(6,19)12(17)13(15)18/h6-11H,3H2,1-2H3
charge 0 multiplicity 1
40 atoms
Cl 2.437944 2.055462 -2.833928
Cl 2.871573 -2.899974 0.005229
Cl 1.678859 1.674501 2.179382
Cl -1.2019 1.517079 2.616327
Cl 4.134127 2.599327 0.055369
Cl 4.361291 -0.458908 1.843795
O  -2.648109 1.561499 -0.00041
O  -1.644536 -1.798083 -0.227143
O  -3.995108 0.181892 -1.318523
O  -3.598662 -2.217359 0.995697
C  0.825055 0.583811 -0.980332
C  0.948009 -0.786503 -0.184135
C  -0.137496 1.441838 -0.081912
C  0.093575 -0.542097 1.101645
C  2.322757 0.84025 -1.430137
C  2.488157 -1.107451 -0.314808
C  0.154163 0.989431 1.381239
C  -1.499049 0.697597 -0.33115
C  -1.393441 -0.590131 0.57413
C  2.690643 -0.640597 -1.797905
C  3.334233 1.058153 -0.306293
C  3.429943 -0.119922 0.373409
C  -3.881174 1.176189 -0.568114
C  -2.847455 -2.505757 0.045614
C  -4.982497 2.098399 -0.109135
C  -3.049493 -3.586409 -0.984564
H  0.309287 0.433482 -1.945211
H  0.455817 -1.607684 -0.731767
H  -0.165695 2.523689 -0.265245
H  0.28544 -1.197903 1.961271
H  -1.611445 0.385711 -1.384494
H  -2.116639 -0.556393 1.403879
H  1.990164 -1.109876 -2.508081
H  3.729901 -0.745681 -2.138159
H  -4.59854 3.112102 0.08081
H  -5.402073 1.71052 0.837536
H  -5.788188 2.119482 -0.858259
H  -2.093476 -4.061157 -1.256447
H  -3.473658 -3.126221 -1.895838
H  -3.759108 -4.335909 -0.605043
