program: Gaussian 09
title: 000186165
version: EM64L-G09RevD.01
frameworkgroup: C1[X(C15H13ClN2O6)]
method: RPBEPBE
basis: SDD
operation: Freq
keyword: #p
keyword: freq=noraman
keyword: PBEPBE/SDD
title: #p freq=noraman PBEPBE/SDD
converged: YES YES NO NO
title: Mulliken charges:
elementType: Cl O O O O O O N N C C C C C C C C C C C C C C C H H H H H H H H H H H H H
charge: -0.022228 -0.321102 -0.279116 -0.353000 -0.382011 -0.216053 -0.163571 -0.462015 0.013029 0.335575 0.150048 0.135115 -0.430479 0.241567 0.495499 0.066998 -0.279531 -0.368187 -0.325128 0.270160 -0.260117 -0.333016 -0.525562 -0.516809 0.369252 0.340819 0.269983 0.208698 0.242145 0.286518 0.234737 0.233688 0.246985 0.403392 0.229266 0.241456 0.222994
chargesum: 0.00000
title: Mulliken charges with hydrogens summed into heavy atoms:
elementType: Cl O O O O O O N N C C C C C C C C C C C C C C C
charge: -0.022228 -0.321102 -0.279116 0.050393 -0.382011 -0.216053 -0.163571 -0.092763 0.013029 0.335575 0.150048 0.135115 -0.089660 0.241567 0.495499 0.066998 -0.009549 -0.368187 -0.116430 0.270160 -0.017972 -0.046498 0.189848 0.176908
polarizability: 3.99015307e+02 -7.78834379e+00 2.43174253e+02 1.75183239e+00 -2.83207709e+00 9.47465650e+01
1716.lowfreq: -6.5252 -0.0030 -0.0024 -0.0018 1.5580 4.0962 16.9812 25.6471 40.2541
frequency: 16.9203 25.6444 40.2497 48.2369 54.8105 63.5190 73.3891 110.2932 131.3376 143.0178 148.3263 154.7989 162.7692 180.5380 185.3850 200.1524 228.2912 252.6896 253.9870 264.2852 309.6342 340.7026 351.1489 381.2739 410.4979 418.5606 425.4169 451.0710 455.8201 475.7172 498.3356 524.1224 565.9260 579.5252 590.0426 620.7902 658.5211 675.9616 687.8608 701.0960 707.6275 721.5441 732.8237 761.2184 764.0606 802.9756 822.3566 829.6011 833.1145 905.7326 908.7034 921.2578 930.1768 975.8274 992.3001 994.1296 1013.9265 1091.7258 1096.8690 1108.8871 1118.0735 1147.3757 1150.1866 1161.3516 1169.7440 1179.6408 1194.7060 1213.7200 1230.4533 1275.5366 1281.3599 1298.3747 1341.5326 1364.7565 1366.7828 1397.0647 1406.5388 1426.0520 1437.9035 1444.9278 1460.8160 1465.1662 1468.7869 1470.6800 1471.9028 1486.2467 1521.4102 1561.4141 1586.1543 1597.2352 1610.8279 1640.9651 2584.0101 2969.4627 2975.0599 3064.5798 3069.0257 3125.3885 3128.5512 3135.0831 3166.3661 3180.4292 3185.3463 3205.2634 3502.7063
redmass: 6.1708 8.8199 6.7040 6.6633 7.4933 3.7111 4.0091 8.4857 4.7957 6.0039 2.3865 3.0966 2.3134 4.7557 5.6592 2.0053 5.1522 5.0805 3.1841 2.7555 5.2871 6.0384 8.2705 8.8698 6.7237 7.6508 8.4409 7.2087 4.0183 5.2220 6.7860 3.3597 5.9254 5.8493 6.6599 6.8518 7.9721 5.3086 7.8496 3.8418 3.5726 3.1962 2.5478 5.5283 1.8702 2.4320 6.3826 1.5495 6.6794 6.9396 6.2388 1.4280 1.5039 1.3670 1.1299 4.5897 5.1131 2.1873 3.8651 1.2431 1.2550 1.7271 1.6589 1.8639 2.5723 1.8381 1.4599 5.7918 1.2869 3.5171 4.7537 3.1583 2.5296 7.7972 9.0795 3.1176 3.4481 2.8339 1.2455 1.5540 1.0641 2.4405 1.0540 1.0591 1.3029 1.9587 2.6091 5.7575 4.6076 4.2115 5.8149 3.8084 1.0743 1.0314 1.0322 1.1046 1.1049 1.0892 1.1013 1.1009 1.0905 1.0918 1.0979 1.0926 1.0755
irintensity: 1.4858 0.3157 3.3945 0.4719 1.0698 5.5610 2.5942 0.1290 4.7179 1.1517 0.9074 2.3215 0.1058 0.0268 0.7939 3.1319 1.1238 0.0713 0.6351 2.5702 1.5850 4.2196 0.2297 9.2041 24.1679 10.6549 3.3781 24.9095 11.3264 16.1718 18.3732 3.7027 7.5891 10.8922 1.9192 25.3561 10.6086 4.7149 57.3993 19.4403 11.0765 12.5088 7.3452 17.8507 93.7608 16.9428 12.3561 25.9220 17.9308 61.7267 52.5353 1.2873 29.6853 2.5220 137.6260 115.7863 14.6628 8.5708 19.9535 2.7116 0.0655 3.0312 8.5453 43.6405 154.6071 64.8147 82.3996 289.9782 21.6934 112.0526 16.8710 139.3327 235.9193 56.7683 59.7178 56.4596 123.0735 42.4322 11.7241 44.8646 4.2522 74.9798 21.1365 11.4216 173.1209 115.9718 778.6705 222.8633 74.4611 32.9282 33.0150 51.3078 898.4712 67.3882 57.6202 31.1048 34.6530 12.8895 24.5554 14.2762 6.4030 1.0249 4.7989 13.9342 59.5668
temp: 298.150 k
press: 1.00000 atm
elementType: 17 8 8 8 8 8 8 7 7 6 6 6 6 6 6 6 6 6 6 6 6 6 6 6 1 1 1 1 1 1 1 1 1 1 1 1 1
symmnumber: 1
zpe: 687939.4 jmol-1
zpe.correction: 0.262022 hartree
zpe.thermalcorrener: 0.284616 hartree
zpe.thermalcorrenthalpy: 0.285560 hartree
zpe.thermalcorrgfe: 0.207500 hartree
zpe.sumelectzpe: -1598.472905 hartree
zpe.sumelectthermal: -1598.450311 hartree
zpe.sumelectthermalent: -1598.449367 hartree
zpe.sumelectthermalfe: -1598.527427 hartree
dipole: 6.7471 8.4908 1.9728
dipole: 11.0231
quadrupole: -188.0108 -125.0706 -148.6744
quadrupole: -15.8605 8.4328 -2.1536
quadrupole: -34.0922 28.8480 5.2442 -15.8605 8.4328 -2.1536
hfenergy: -1598.7349269 hartree
pointgroup: C01 [X(C15H13Cl1N2O6)]
dipole: 2.5511382 3.2752921 1.2538583 debye
polarizability: 397.5403721|-7.5276988|242.3682739|21.8578764|10.0850052|97.0274792 unknown
InChI: InChI=1S/C15H13ClN2O6/c1-23-12-7-10(13(24-2)6-9(12)16)17-15(20)8-4-3-5-11(14(8)19)18(21)22/h3-7,17,19H,1-2H3
charge 0 multiplicity 1
37 atoms
Cl 6.375907 -0.280357 0.277908
O  1.956666 2.580031 0.618005
O  4.265816 -2.461628 -0.377919
O  -2.919436 -2.000897 -0.432757
O  -0.477789 -1.561555 -0.330711
O  -6.720697 -0.537158 -0.903636
O  -5.585177 -2.216174 0.145542
N  0.389532 0.560459 0.08007
N  -5.654868 -1.034323 -0.354682
C  1.774342 0.256214 0.118454
C  -2.046364 0.271111 -0.149688
C  2.632485 1.362603 0.41181
C  2.341166 -1.015308 -0.111871
C  -0.665977 -0.290895 -0.141803
C  3.744106 -1.196372 -0.057535
C  -3.141017 -0.670187 -0.274165
C  4.027073 1.19398 0.46962
C  4.569471 -0.086567 0.234204
C  -2.328077 1.65789 -0.055869
C  -4.473054 -0.146923 -0.271758
C  -3.648244 2.144171 -0.082057
C  -4.72085 1.236431 -0.196719
C  2.761403 3.770911 0.910008
C  4.681868 -3.285731 0.779308
H  0.19755 1.549215 0.267102
H  1.700209 -1.866031 -0.345745
H  4.695614 2.030463 0.684592
H  -1.515663 2.390093 0.020763
H  -3.842689 3.217947 -0.016626
H  -5.758901 1.578263 -0.233944
H  3.447666 3.996635 0.072527
H  3.335944 3.637085 1.845615
H  2.037706 4.589603 1.030752
H  -1.877583 -2.13453 -0.445055
H  5.485005 -2.788539 1.353935
H  5.057695 -4.224118 0.3458
H  3.815263 -3.491714 1.436426
