program: Gaussian 09
title: 000186114
version: EM64L-G09RevD.01
frameworkgroup: C1[X(C3H3NO2)]
method: RPBEPBE
basis: SDD
operation: Freq
keyword: #pfreq=noraman
keyword: PBEPBE/SDD
title: #p freq=noraman PBEPBE/SDD
converged: NO NO NO NO
title: Mulliken charges:
elementType: O O N C C C H H H
charge: -0.227295 -0.217397 -0.408083 -0.157676 0.229525 -0.106124 0.345849 0.271992 0.269209
chargesum: 0.00000
title: Mulliken charges with hydrogens summed into heavy atoms:
elementType: O O N C C C
charge: -0.227295 -0.217397 -0.062234 0.114316 0.229525 0.163085
polarizability: 5.71726463e+01 6.72047769e-01 4.43117572e+01 1.64980929e-03 -1.55965393e-04 1.89762236e+01
1716.lowfreq: -14.1793 -0.0011 -0.0009 -0.0005 20.6376 34.9161 250.2034 459.0390 567.1188
frequency: 250.1994 459.0377 567.1100 576.1408 668.3653 687.1785 707.6933 795.4921 803.9671 870.0243 1002.3738 1049.6387 1095.0190 1150.5839 1305.0109 1368.1236 1583.8667 1752.1242 3244.0991 3279.4696 3620.6321
redmass: 6.6780 7.3375 2.4396 1.3998 2.4307 9.7644 1.9602 6.3342 1.2913 7.8051 4.3562 2.6651 1.7106 1.6296 1.6162 2.0445 4.8316 10.9347 1.0921 1.1127 1.0815
irintensity: 1.1659 1.7918 21.0357 61.9750 152.7773 1.1167 40.5840 57.0892 2.3207 0.1695 32.5299 66.1291 9.0294 21.9778 9.6107 26.7258 1.5084 591.9464 3.5006 0.8978 79.1281
temp: 298.150 k
press: 1.00000 atm
elementType: 8 8 7 6 6 6 1 1 1
symmnumber: 1
zpe: 160515.8 jmol-1
zpe.correction: 0.061137 hartree
zpe.thermalcorrener: 0.065773 hartree
zpe.thermalcorrenthalpy: 0.066717 hartree
zpe.thermalcorrgfe: 0.033308 hartree
zpe.sumelectzpe: -320.861838 hartree
zpe.sumelectthermal: -320.857202 hartree
zpe.sumelectthermalent: -320.856258 hartree
zpe.sumelectthermalfe: -320.889668 hartree
dipole: -4.5369 3.0200 -0.0004
dipole: 5.4501
quadrupole: -37.0569 -28.7924 -35.5975
quadrupole: 1.8252 -0.0011 0.0009
quadrupole: -3.2413 5.0232 -1.7819 1.8252 -0.0011 0.0009
hfenergy: -320.9229755 hartree
pointgroup: C01 [X(C3H3N1O2)]
dipole: -1.8347519 1.1096856 -0.0001396 debye
dipolederiv: -0.8590925 0.1347033 -0.0000771 -0.4741477 -0.5298699 -0.0000896 0.0002137 0.0001362 -0.1722641 -1.4694516 0.0087836 0.000265 -0.0430939 -0.4130189 -0.00001 -0.0006018 -0.0000006 -0.3690258 -0.7701793 -0.1912034 -0.0000911 0.3817442 -0.5544209 0.0000478 0.000117 -0.000119 -0.3478197 0.2719456 0.3562215 0.0000666 0.233278 0.1290195 0.0000353 -0.0000752 0.0001076 -0.1630796 2.2060165 -0.0878505 -0.0002438 0.1029555 0.8129866 0.0000674 0.0003153 0.0000206 0.3384751 0.3547205 -0.2418926 0.000071 -0.2117789 0.1173753 -0.0000364 -0.0000588 -0.0001111 -0.1572652 0.1822657 0.0119497 0.0000165 -0.013232 0.2567609 -0.000018 0.0000294 -0.0000399 0.3965862 0.0414475 0.0371053 -0.0000017 0.0634934 0.0882446 -0.0000177 0.0000308 -0.0000124 0.2362505 0.0423276 -0.0278169 -0.0000055 -0.0392186 0.0929226 0.0000212 0.0000295 0.0000186 0.2381426 unknown
polarizability: 57.0902928|1.226379|44.3941107|0.001655|-0.0000843|18.9762236 unknown
InChI: InChI=1S/C3H3NO2/c5-3-4-1-2-6-3/h1-2,4H
charge 0 multiplicity 1
9 atoms
O  0.011721 -1.131647 0.000098
O  2.070922 0.074059 0.000172
N  -0.094664 1.120347 0.000053
C  -1.423331 0.642241 -0.000086
C  0.830207 0.063345 -0.00029
C  -1.34936 -0.723672 -0.000031
H  0.192018 2.096917 0.000229
H  -2.285886 1.302557 -0.000018
H  -2.093726 -1.513748 0.000074
