program: Gaussian 09
title: 000186186
version: EM64L-G09RevD.01
frameworkgroup: C1[X(C14H21N2O3PS2)]
method: RPBEPBE
basis: SDD
operation: Freq
keyword: #p
keyword: freq=noraman
keyword: PBEPBE/SDD
title: #p freq=noraman PBEPBE/SDD
converged: YES YES NO NO
title: Mulliken charges:
elementType: S S P O O O N N C C C C C C C C C C C C C C H H H H H H H H H H H H H H H H H H H H H
charge: -0.307650 -0.260156 0.674799 -0.427451 -0.207045 -0.679288 -0.383628 -0.469062 -0.173675 -0.430511 -0.361676 0.177244 -0.702831 0.365933 0.398211 -0.497896 0.497274 -0.721289 -0.364628 -0.389377 -0.190149 -0.806201 0.305756 0.222884 0.221804 0.255510 0.230861 0.212768 0.219358 0.234118 0.327570 0.270875 0.291264 0.282245 0.209209 0.243386 0.236857 0.229509 0.275179 0.215923 0.221045 0.131814 0.421120
chargesum: 0.00000
title: Mulliken charges with hydrogens summed into heavy atoms:
elementType: S S P O O O N N C C C C C C C C C C C C C C
charge: -0.175836 -0.260156 0.674799 -0.427451 -0.207045 -0.679288 0.037492 -0.141492 0.132081 0.014176 0.124694 0.177244 -0.036586 0.365933 0.398211 -0.227021 0.497274 0.061429 -0.121242 -0.152520 0.039360 -0.094055
polarizability: 2.69281038e+02 -3.40852059e+01 2.38129138e+02 1.11023294e+01 -1.03552129e+01 2.11182274e+02
1716.lowfreq: -13.2097 -5.4398 -0.0026 -0.0021 -0.0020 8.8588 12.3042 23.6344 35.4528
frequency: 8.9753 23.5913 35.4254 42.4670 50.5961 67.8500 89.8963 100.1193 106.4787 113.8015 126.1235 130.7418 150.2353 166.1901 175.0339 185.1773 198.9528 207.9991 222.1064 227.5275 234.9731 249.6679 256.6534 276.8117 291.5308 304.1778 340.6752 347.1326 408.2528 413.6595 420.7168 429.4748 438.0175 444.6526 469.6185 514.2444 533.7086 541.4752 595.4869 611.3860 635.3207 642.2070 668.9571 676.7445 691.8422 709.2074 751.0280 777.3602 794.7140 833.5529 860.5347 879.7507 891.7550 909.2142 933.2383 938.5172 956.1420 978.1414 982.9933 989.2422 1000.6277 1005.7042 1030.1261 1048.8224 1052.7981 1064.6255 1095.5483 1096.9742 1117.9606 1159.1285 1169.6135 1180.8213 1231.5763 1240.2465 1251.3526 1265.7138 1279.1385 1306.2386 1324.0342 1335.6943 1349.1558 1358.4928 1384.8220 1391.7446 1402.5672 1404.0909 1427.0496 1432.1901 1453.4849 1458.8008 1459.4316 1471.5014 1474.3126 1477.0109 1484.2744 1487.2181 1504.9789 1520.7756 1546.0869 1599.0155 1617.7744 1625.0891 1717.3516 2457.2010 2960.4425 2974.7490 2980.9661 2990.8479 3007.0757 3015.8059 3046.4427 3060.3987 3069.9273 3076.5965 3086.1825 3090.8706 3107.1191 3114.3596 3130.4427 3141.7999 3143.6278 3164.1857 3504.8512
redmass: 5.5669 5.0795 5.1617 5.3863 5.3105 6.3316 5.0835 3.1086 1.0685 4.8053 6.4981 5.2081 2.1833 3.3614 1.4401 3.0170 3.6749 3.2477 3.1099 1.4393 2.0344 5.7102 3.2628 4.8993 2.8053 3.4170 4.3589 4.7697 5.1687 3.6647 4.1968 3.2856 5.1835 4.0440 3.7508 5.0728 7.7655 3.6669 2.6937 7.2052 2.5449 2.0077 2.0610 1.5452 2.3348 5.0289 2.7230 1.7153 1.9722 2.1867 6.3728 2.0840 1.3762 1.8316 2.0356 3.4332 4.2805 4.3737 1.3555 6.0439 1.7996 1.5712 1.5285 1.6182 1.5751 1.9377 2.4578 1.5454 2.7235 2.2585 1.8226 1.0975 1.2812 1.1077 2.3221 1.2655 1.5676 1.2824 1.3981 1.4108 1.2202 1.4522 7.4268 1.2146 1.2107 1.1721 2.3022 1.1198 1.0777 1.0828 1.1627 1.0613 1.4753 1.0493 1.6809 1.0499 2.1580 1.3718 3.7688 5.8713 6.3444 4.2517 1.4045 1.0381 1.0661 1.0395 1.0360 1.0606 1.0380 1.0839 1.1003 1.0943 1.0982 1.0996 1.1004 1.1003 1.0986 1.0986 1.0868 1.0932 1.0921 1.0999 1.0765
irintensity: 0.5321 1.2492 2.3019 1.6214 2.3802 1.8474 2.2267 2.7938 0.8250 3.3468 5.6941 0.5213 5.8742 1.4133 0.1671 2.4929 2.1096 4.0475 6.5224 21.1841 1.9349 6.0746 6.7971 8.6333 1.6256 11.5819 14.3532 33.9787 22.6740 4.8974 6.0351 24.0115 32.7096 28.3181 17.0827 0.6381 69.0442 15.5368 4.4373 81.1887 22.5484 87.1349 52.5741 15.3502 37.8945 33.7019 37.0207 222.5540 32.2371 182.2570 241.7054 38.8492 4.6602 8.1646 27.0171 85.3604 104.3484 51.9512 1.3396 10.6370 9.2284 2.7082 36.4585 11.0680 22.2560 1.3706 82.5694 11.0586 53.3729 68.7292 4.2325 3.3979 32.8593 4.5398 51.4680 13.5637 219.4442 17.0715 30.5798 19.7598 40.1978 64.9222 3.4424 14.1769 19.9462 63.0465 3.3081 45.7940 18.5958 20.3278 39.4791 11.2755 6.3373 8.5069 28.8439 17.3524 62.2534 669.4406 411.6384 15.6914 23.8788 900.9664 645.5545 12.0586 22.9984 20.1445 29.9993 21.7426 13.7352 4.4942 2.8532 14.2338 11.1011 49.0705 40.3678 16.2165 12.2535 8.4980 3.0865 1.9875 14.2705 16.8185 69.7506
temp: 298.150 k
press: 1.00000 atm
elementType: 16 16 15 8 8 8 7 7 6 6 6 6 6 6 6 6 6 6 6 6 6 6 1 1 1 1 1 1 1 1 1 1 1 1 1 1 1 1 1 1 1 1 1
symmnumber: 1
zpe: 870163.2 jmol-1
zpe.correction: 0.331428 hartree
zpe.thermalcorrener: 0.356815 hartree
zpe.thermalcorrenthalpy: 0.357759 hartree
zpe.thermalcorrgfe: 0.273917 hartree
zpe.sumelectzpe: -2016.962319 hartree
zpe.sumelectthermal: -2016.936931 hartree
zpe.sumelectthermalent: -2016.935987 hartree
zpe.sumelectthermalfe: -2017.019830 hartree
dipole: 0.2354 -8.6114 2.5284
dipole: 8.9780
quadrupole: -150.7435 -155.5264 -145.8809
quadrupole: 8.5709 0.5537 -0.7634
quadrupole: -0.0266 -4.8095 4.8361 8.5709 0.5537 -0.7634
hfenergy: -2017.2937465 hartree
pointgroup: C01[X(C14H21N2O3P1S2)]
dipole: 1.153121 3.2183471 0.8882843 debye
polarizability: 240.7131027|-36.0635856|268.7257912|-1.1527808|6.889213|209.1535557 unknown
InChI: InChI=1S/C14H20N2O3PS.HS/c1-4-12(9-19-20(18)21)14(17)16-11(3)15-13-7-5-6-10(2)8-13;/h5-8,12,15-16H,4,9H2,1-3H3;1H
charge 0 multiplicity 1
43 atoms
S  -0.339952 -1.616975 2.596506
S  -0.07201 -4.162417 -0.174678
P  -0.636596 -2.238925 0.29862
O  -2.404328 -2.08145 0.15278
O  -2.734088 2.608718 0.240076
O  0.011896 -0.928674 -0.443238
N  -0.714725 1.370749 0.242276
N  1.355889 2.017325 1.131446
C  -2.765575 0.31056 -0.661498
C  -4.083955 0.657289 -1.389857
C  -2.990323 -0.769303 0.467955
C  -2.11543 1.546743 -0.038134
C  -3.8827 1.531848 -2.645033
C  0.01362 2.188599 1.035608
C  2.186852 1.115132 0.342416
C  2.657541 -0.080898 0.920675
C  3.458662 -0.96816 0.160581
C  -0.583878 3.296304 1.871643
C  2.513856 1.477291 -0.982435
C  3.798341 -0.599056 -1.16639
C  3.33179 0.607024 -1.733714
C  3.866833 -2.312924 0.72835
H  -2.052193 -0.131754 -1.382536
H  -4.563859 -0.298682 -1.675514
H  -4.765105 1.170857 -0.684643
H  -4.068987 -0.979082 0.559246
H  -2.6110 -0.431766 1.455211
H  -3.203192 1.04136 -3.367454
H  -4.845539 1.710661 -3.156682
H  -3.457186 2.516019 -2.380251
H  1.832054 2.592392 1.83264
H  2.348659 -0.358409 1.934869
H  -0.97462 4.097735 1.223818
H  -1.448094 2.929139 2.447439
H  0.169169 3.71437 2.561779
H  2.137402 2.4121 -1.411438
H  4.4159 -1.276577 -1.767544
H  3.598051 0.866688 -2.763834
H  3.070461 -3.057559 0.531447
H  4.79636 -2.686953 0.265004
H  4.013209 -2.271557 1.821607
H  -0.828482 -2.810862 3.099509
H  -0.293129 0.343985 -0.111828
