program: Gaussian 09
title: 000186113
version: EM64L-G09RevD.01
frameworkgroup: C1[X(C8H8BrNO)]
method: RPBEPBE
basis: SDD
operation: Freq
keyword: #p
keyword: freq=noraman
keyword: PBEPBE/SDD
title: #p freq=noraman PBEPBE/SDD
converged: YES YES NO NO
title: Mulliken charges:
elementType: Br O N C C C C C C C C H H H H H H H H
charge: 0.020632 -0.283789 -0.394709 0.292426 -0.345929 -0.339912 0.180600 -0.181394 -0.193489 -0.203066 -0.608455 0.282992 0.221409 0.255858 0.253218 0.308256 0.227911 0.279558 0.227885
chargesum: 0.00000
title: Mulliken charges with hydrogens summed into heavy atoms:
elementType: Br O N C C C C C C C C
charge: 0.020632 -0.283789 -0.086453 0.292426 -0.062937 -0.118503 0.180600 0.074464 0.059729 -0.203066 0.126899
polarizability: 1.89146964e+02 -2.78935071e+00 1.04004514e+02 -1.97570891e-01 1.84950706e+00 4.85430609e+01
1716.lowfreq: -5.7335 -2.2317 -0.0003 0.0002 0.0003 8.3328 44.2728 66.1553 111.4317
frequency: 44.2136 66.1349 111.4301 114.9312 159.9515 217.6815 236.5410 281.5047 320.9160 405.2764 423.9472 450.7823 502.4482 559.5268 622.1026 676.0900 686.0198 741.6453 803.0668 828.0401 855.6849 954.3660 986.8936 989.4716 1004.3537 1061.6722 1110.8556 1121.9074 1135.4631 1150.3224 1190.0830 1269.1473 1295.4922 1364.8930 1388.6785 1418.1049 1452.2763 1471.5314 1488.1835 1520.3751 1565.5433 1593.7944 1607.1444 2979.3319 3058.7053 3112.4777 3128.4208 3156.5157 3170.3826 3176.2660 3568.8603
redmass: 4.2399 5.6475 3.5162 1.1603 4.0003 9.1788 6.4377 5.4786 4.3735 2.8694 5.4452 4.7670 4.0930 1.1636 6.7714 4.7408 6.1989 3.3971 3.7463 1.4108 1.5103 1.3905 4.9817 1.3977 4.2504 2.4758 1.3605 1.2940 1.6474 2.9139 1.1647 2.2964 1.2994 5.0069 3.9641 1.1862 1.4486 1.7793 1.0466 1.5664 7.5816 6.0902 7.4432 1.0350 1.1024 1.0981 1.0892 1.0887 1.0953 1.0972 1.0772
irintensity: 4.7073 3.2872 2.5273 0.5373 1.2543 1.6622 1.2039 4.7864 20.3252 0.6904 1.4101 14.6476 10.5266 126.5703 1.3278 16.2352 11.1401 24.3428 11.3913 15.8296 35.0037 1.8485 63.5522 4.6848 11.8626 35.7908 7.5935 0.2894 64.0295 4.8639 3.4367 121.8325 7.1434 0.3902 4.8479 33.4248 176.1672 7.6403 16.9097 133.4154 31.8648 83.5363 117.4273 80.6819 36.3400 1.4786 13.2974 0.3075 5.9293 1.9829 14.1953
temp: 298.150 k
press: 1.00000 atm
elementType: 35 8 7 6 6 6 6 6 6 6 6 1 1 1 1 1 1 1 1
symmnumber: 1
zpe: 374427.8 jmol-1
zpe.correction: 0.142612 hartree
zpe.thermalcorrener: 0.153346 hartree
zpe.thermalcorrenthalpy: 0.154290 hartree
zpe.thermalcorrgfe: 0.104320 hartree
zpe.sumelectzpe: -452.301952 hartree
zpe.sumelectthermal: -452.291218 hartree
zpe.sumelectthermalent: -452.290274 hartree
zpe.sumelectthermalfe: -452.340245 hartree
dipole: 1.0982 -3.5579 0.9317
dipole: 3.8384
quadrupole: -71.9041 -68.7638 -76.9526
quadrupole: -14.5530 3.5090 1.6169
quadrupole: 0.6361 3.7764 -4.4125 -14.5530 3.5090 1.6169
hfenergy: -452.4445645 hartree
pointgroup: C01 [X(C8H8Br1N1O1)]
dipole: -0.4514712 -1.3829391 -0.4051633 debye
dipolederiv: -0.8135119 0.0458697 0.0113133 0.0596376 -0.0647106 0.0026165 0.0145275 0.0015666 -0.0323874 -0.8481538 0.2249238 0.0422226 0.0201311 -0.894678 -0.1606052 -0.0362159 -0.1271553 -0.4071122 -0.9862747 -0.3541089 -0.1244349 -0.415994 -0.6815651 -0.03335 -0.142601 -0.0096203 -0.48425 -0.4596336 0.0050482 0.0073613 0.0791702 -0.0625765 -0.0178271 0.045238 -0.0139559 0.0065226 0.0696001 -0.0919457 0.0026835 0.1293946 0.03219 -0.0212557 0.0094495 0.0084758 -0.1069459 0.0904675 0.0509243 -0.0249451 -0.1316864 0.0256627 -0.0329862 -0.0698493 -0.0335365 -0.1393608 1.612335 0.1020729 0.0622425 0.3710522 1.2441454 0.3229387 0.1531611 0.2550822 0.2918519 -0.4232026 0.1994855 -0.0138929 0.1319771 0.007877 -0.0115334 -0.0063897 -0.0145974 -0.0939973 -0.5212336 -0.0944729 0.0234561 -0.0921205 0.0225089 -0.0146005 0.0152947 -0.0144982 -0.09087 1.4151211 -0.0993924 -0.030203 -0.0662835 0.0772556 -0.0194174 -0.0380643 -0.0176038 -0.1202383 0.5340109 0.1544482 0.0476586 -0.0900933 0.0132317 -0.0809869 0.0006224 -0.0764852 0.2411148 0.1028525 0.066496 -0.0051052 0.0229996 0.0322724 0.0173826 -0.0185175 0.0022604 0.157059 -0.0117536 -0.1064535 0.0169278 -0.104407 -0.0250429 0.026039 0.0293743 0.0185476 0.1440628 0.0355932 -0.0728502 0.0097464 -0.072031 0.0088582 0.0173441 0.0111151 0.0174661 0.1590606 0.0536486 0.0621174 -0.0039889 0.065925 -0.0172095 0.0209016 -0.0009527 0.0226756 0.1598717 0.1449006 0.0523956 0.0228169 0.097567 0.1500876 -0.0606075 0.0495784 -0.0634131 0.317387 -0.0690938 -0.0551482 -0.0615566 -0.0335438 0.1138703 -0.0413537 -0.1392185 -0.0483779 -0.1236465 0.1477288 -0.0094366 -0.0018389 0.1410086 0.0241726 -0.0381763 0.0360572 -0.0349482 0.1198528 -0.0734008 -0.0799732 0.0195366 -0.1127037 -0.0063497 0.1254777 0.0873908 0.1281175 0.0020252 unknown
polarizability: 189.2095899|1.57572|104.0016268|0.0231296|-0.3281545|48.4833219 unknown
InChI: InChI=1S/C8H8BrNO/c1-10-8(11)6-2-4-7(9)5-3-6/h2-5,10H,1H3
charge 0 multiplicity 1
19 atoms
Br 4.4411 -0.251943 -0.065967
O  -2.337791 1.438165 0.31709
N  -2.598645 -0.805785 -0.250458
C  -0.327659 0.106799 0.020143
C  0.479374 1.265545 -0.105643
C  0.302494 -1.158253 0.145582
C  -1.824037 0.306222 0.047561
C  1.885835 1.17118 -0.135387
C  1.710014 -1.270658 0.122909
C  2.485093 -0.101856 -0.026028
C  -4.065137 -0.756541 -0.240164
H  -0.019508 2.237699 -0.170616
H  -0.284748 -2.070746 0.302773
H  2.501764 2.068847 -0.238734
H  2.191604 -2.246601 0.229359
H  -2.142129 -1.662731 -0.5626
H  -4.481666 -0.94288 -1.247572
H  -4.358747 0.254681 0.08301
H  -4.484709 -1.497743 0.464841
