program: Gaussian 09
title: 000186123
version: EM64L-G09RevD.01
frameworkgroup: C1[X(C15H13Cl2NO)]
method: RPBEPBE
basis: SDD
operation: Freq
keyword: #p
keyword: freq=noraman
keyword: PBEPBE/SDD
title: #p freq=noraman PBEPBE/SDD
converged: YES YES NO NO
title: Mulliken charges:
elementType: Cl Cl O N C C C C C C C C C C C C C C C H H H H H H H H H H H H H
charge: -0.013640 0.001380 -0.278504 -0.387320 -0.544923 -0.373614 0.461857 -0.425925 -0.399171 0.158654 0.326302 -0.228260 -0.222744 -0.311779 -0.370153 -0.240149 -0.093707 -0.200313 -0.101430 0.219373 0.226617 0.265572 0.226451 0.326837 0.246741 0.235453 0.233559 0.228488 0.252550 0.285546 0.232749 0.263503
chargesum: 0.00000
title: Mulliken charges with hydrogens summed into heavy atoms:
elementType: Cl Cl O N C C C C C C C C C C C C C C C
charge: -0.013640 0.001380 -0.278504 -0.060483 -0.098932 0.118408 0.461857 -0.179184 -0.163718 0.158654 0.326302 0.005300 0.005744 -0.059229 -0.084607 -0.007399 -0.093707 0.063191 -0.101430
polarizability: 2.37004563e+02 9.90913851e+00 2.24440494e+02 -2.10993588e+01 4.08704633e+00 1.01840296e+02
1716.lowfreq: -5.8593 -4.4792 0.0013 0.0018 0.0025 4.9094 12.6773 18.3638 29.0027
frequency: 12.2086 18.3097 28.8351 40.2635 60.6280 77.1299 100.1167 147.8351 166.6011 182.8497 226.5763 245.4891 281.7958 306.8362 330.9002 352.7029 396.5219 403.7874 417.4651 438.3366 471.8281 491.5324 519.4276 552.0188 566.9616 584.6945 617.6538 657.6701 684.6602 706.7272 720.8183 736.0862 756.9978 767.5075 822.7301 844.0626 857.8958 872.3823 885.2213 923.7089 969.1230 979.9914 982.6114 989.3847 998.1596 999.7056 1010.2173 1027.3134 1058.8189 1088.7507 1121.6854 1135.0895 1149.3269 1173.3824 1187.0393 1187.3463 1210.3063 1231.6437 1261.0696 1275.0769 1313.4570 1328.8923 1354.0150 1359.1836 1379.4695 1381.1197 1439.9708 1450.8874 1463.4742 1469.3870 1483.2561 1504.9235 1555.7539 1591.1980 1592.4422 1601.9737 1612.2944 2991.3683 2997.5336 3060.9744 3082.2095 3114.9624 3115.7459 3133.7920 3145.2644 3147.0531 3161.1113 3164.2704 3178.8276 3552.5379
redmass: 6.8140 7.3647 3.9154 7.7757 4.6130 7.8399 5.8370 4.2538 5.9996 27.0110 5.1214 5.8703 9.2831 3.7935 7.5251 2.3153 3.5169 2.8541 6.1174 3.2665 4.0180 3.9747 6.5255 6.3621 1.8764 1.6424 6.2441 6.9462 5.3804 1.8708 4.2901 3.5611 2.0514 2.9605 3.2240 1.3870 1.2931 2.5532 1.6380 1.4475 2.6732 1.4079 1.3585 5.8576 1.3864 3.6968 2.2558 2.1267 3.2662 1.6212 2.0339 1.6937 2.0776 1.0619 1.2884 1.1159 2.4929 1.3090 1.3569 2.2195 1.3574 1.2681 1.4007 3.7481 5.5871 7.3073 2.1490 2.3536 1.1266 1.1159 2.2324 1.9978 8.1466 6.0002 6.4168 7.7533 6.1186 1.0655 1.0608 1.1009 1.0990 1.0884 1.0869 1.0902 1.0956 1.0918 1.0886 1.1014 1.0973 1.0770
irintensity: 0.2408 0.0801 0.0156 5.6167 2.7513 2.0245 1.4138 5.5737 5.0893 0.1410 1.5742 1.4123 2.0771 6.8750 13.0226 2.5987 1.7978 0.0855 2.8885 7.2562 2.7188 11.2012 16.3250 10.7335 21.4305 118.0985 0.4097 11.9925 2.3215 52.9259 10.2801 26.7620 31.7156 18.0865 0.8599 22.7495 0.5403 25.6184 15.7119 5.5576 7.4069 1.1401 1.8365 0.1558 5.2972 46.8651 5.3222 2.6811 6.8530 9.4225 46.8853 15.8845 9.1718 0.0272 5.2694 1.6333 0.2086 6.6429 2.2133 225.7049 5.1420 4.5338 10.5431 6.6164 7.5594 0.3942 4.0749 119.1728 23.0772 14.3193 29.6531 242.3261 82.3485 1.4606 33.8320 122.0822 1.6052 35.3434 34.0702 24.4458 5.7165 7.0261 12.0139 7.0889 38.2308 0.4011 0.3922 18.3529 2.3961 22.1692
temp: 298.150 k
press: 1.00000 atm
elementType: 17 17 8 7 6 6 6 6 6 6 6 6 6 6 6 6 6 6 6 1 1 1 1 1 1 1 1 1 1 1 1 1
symmnumber: 1
zpe: 634255.1 jmol-1
zpe.correction: 0.241575 hartree
zpe.thermalcorrener: 0.259056 hartree
zpe.thermalcorrenthalpy: 0.260000 hartree
zpe.thermalcorrgfe: 0.191670 hartree
zpe.sumelectzpe: -1628.158713 hartree
zpe.sumelectthermal: -1628.141232 hartree
zpe.sumelectthermalent: -1628.140288 hartree
zpe.sumelectthermalfe: -1628.208618 hartree
dipole: 2.8592 -1.0161 -1.1124
dipole: 3.2318
quadrupole: -116.8354 -131.9357 -125.2973
quadrupole: -5.1577 -4.9016 -2.1169
quadrupole: 7.8540 -7.2462 -0.6078 -5.1577 -4.9016 -2.1169
hfenergy: -1628.4002881 hartree
pointgroup: C01 [X(C15H13Cl2N1O1)]
dipole: 1.1664836 -0.2702541 -0.4277815 debye
polarizability: 233.8676434|9.8337329|226.9947272|-22.8211312|-6.7133842|102.422982 unknown
InChI: InChI=1S/C15H13Cl2NO/c16-13-7-6-12(10-14(13)17)15(19)18-9-8-11-4-2-1-3-5-11/h1-7,10,18H,8-9H2
charge 0 multiplicity 1
32 atoms
Cl -2.431627 -3.061696 0.278342
Cl -5.480789 -1.848253 0.03233
O  -0.852613 3.196785 0.080639
N  0.581395 1.458651 -0.514013
C  2.835249 1.776243 0.546936
C  1.802202 2.275086 -0.507264
C  3.232992 0.323327 0.325676
C  2.58706 -0.723579 1.035889
C  4.21793 -0.021896 -0.637045
C  -0.660448 1.965026 -0.174015
C  -1.800706 0.973229 -0.131968
C  2.912204 -2.078071 0.788649
C  4.546636 -1.373307 -0.886506
C  -1.611473 -0.423598 0.018484
C  -3.118506 1.488743 -0.20998
C  3.892137 -2.407101 -0.176006
C  -2.724998 -1.284892 0.070169
C  -4.229419 0.625902 -0.164032
C  -4.033892 -0.765752 -0.02705
H  3.722292 2.4350 0.481376
H  2.397284 1.908866 1.552972
H  1.49171 3.309852 -0.283975
H  2.262213 2.259681 -1.514396
H  0.678132 0.475226 -0.771246
H  1.841311 -0.473197 1.801143
H  4.735074 0.774183 -1.18778
H  2.40857 -2.87194 1.351754
H  5.314111 -1.620424 -1.628693
H  -0.615042 -0.863499 0.132655
H  -3.247155 2.571622 -0.296513
H  4.148064 -3.455086 -0.367005
H  -5.2480 1.018371 -0.231223
