program: Gaussian 09
title: 000186117
version: EM64L-G09RevD.01
frameworkgroup: C1[X(C15H22O3)]
method: RPBEPBE
basis: SDD
operation: Freq
keyword: #pfreq=noraman
keyword: PBEPBE/SDD
title: #p freq=noraman PBEPBE/SDD
converged: YES YES NO NO
title: Mulliken charges:
elementType: O O O C C C C C C C C C C C C C C C H H H H H H H H H H H H H H H H H H H H H H
charge: -0.411147 -0.192140 -0.226211 -0.406727 -0.177906 -0.387695 -0.369574 -0.023804 0.261340 -0.742735 -0.717439 -0.716204 0.048931 0.022210 -0.088464 -0.526982 0.452840 -0.770850 0.191870 0.229569 0.256188 0.206076 0.194537 0.186455 0.188265 0.194595 0.215702 0.245120 0.219544 0.210266 0.202564 0.222083 0.211455 0.212554 0.205322 0.270593 0.225738 0.250554 0.250623 0.382884
chargesum: 0.00000
title: Mulliken charges with hydrogens summed into heavy atoms:
elementType: O O O C C C C C C C C C C C C C C C
charge: -0.028263 -0.192140 -0.226211 0.014712 0.078282 0.012918 0.005146 0.170792 0.261340 -0.062368 -0.082526 -0.086873 0.048931 0.022210 -0.088464 -0.256389 0.452840 -0.043936
polarizability: 1.79126406e+02 2.73789023e+01 1.63477045e+02 1.59309076e+01 8.37698059e+00 1.81399748e+02
1716.lowfreq: -17.5375 -12.4565 -3.8985 -0.0002 0.0004 0.0005 9.5365 21.5370 26.0255
frequency: -4.8516 21.2048 25.8635 63.9323 80.5814 95.1479 100.3152 103.4271 113.8477 164.9390 169.0900 182.3238 201.7866 207.8110 232.0448 236.5297 259.5321 265.3284 288.3563 326.0949 339.8586 381.5970 388.5739 390.4730 424.6356 442.9890 451.9022 480.9833 503.0720 552.7452 588.5226 632.0231 664.7678 668.6368 692.0348 734.4747 782.3942 802.8656 833.9071 875.3485 897.7990 906.4974 912.6196 934.2738 951.8789 966.8319 978.0697 993.5702 1023.4740 1041.1276 1045.5304 1048.1211 1066.8828 1082.2255 1113.9186 1134.8708 1153.2192 1177.0265 1194.0595 1208.0794 1233.0756 1248.1092 1263.0456 1271.2771 1283.9304 1292.1672 1301.0661 1321.9576 1330.4209 1337.0567 1348.3111 1356.1787 1370.1338 1376.5384 1390.5521 1393.6057 1402.3559 1447.5042 1454.1111 1458.7975 1461.8866 1467.7299 1471.5103 1473.4181 1477.7563 1481.3782 1487.4048 1488.0410 1513.6256 1532.5528 1626.3584 1669.0457 2944.2382 2954.3024 2961.5848 2963.7935 2968.1484 2972.5534 2982.6289 2989.6229 2993.0758 3003.7692 3020.7597 3048.5387 3055.2839 3063.0144 3066.4828 3067.4328 3071.2819 3075.2117 3093.6971 3107.0885 3148.5906 3324.2032
redmass: 2.4684 6.2081 4.0166 4.3477 3.0701 2.7379 1.1542 2.0776 4.4522 3.5965 3.6571 2.4453 1.2516 1.9448 1.1263 1.1809 3.1710 3.0432 3.8232 3.9756 5.1239 2.5142 3.4595 4.9887 2.8883 6.4283 3.5130 3.2212 3.2881 7.3601 4.3631 4.1425 1.5056 3.0429 2.5841 1.1534 5.8819 2.3262 1.5259 2.5532 1.5275 2.3655 1.1866 1.6456 1.3886 2.7170 1.8361 2.5060 1.5442 2.7514 2.0742 1.5399 2.3333 2.9038 2.0911 1.8958 2.3308 1.7663 1.6521 2.1424 1.5769 1.9589 1.4267 3.3120 1.1568 1.2566 1.4381 1.3007 1.4233 1.4114 1.6281 3.1907 1.5269 1.2222 1.3137 1.2171 1.2838 1.0445 1.0713 1.0889 1.0818 1.0458 1.0586 1.0482 1.0902 1.0547 1.0552 1.0612 10.6833 8.5200 6.7045 7.3860 1.0606 1.0794 1.0608 1.0360 1.0365 1.0620 1.0355 1.0372 1.0975 1.0853 1.0996 1.1021 1.0992 1.0990 1.0994 1.0961 1.0987 1.0996 1.1001 1.1006 1.0932 1.0630
irintensity: 0.0136 0.0490 0.3014 3.2339 0.9937 2.2386 0.0057 0.1594 0.4056 0.7119 1.1987 0.3679 0.0543 0.2100 0.1024 0.0608 0.0408 0.0852 0.0115 0.3563 19.4242 1.6092 3.5047 14.1757 1.0609 0.1446 3.2827 4.0295 2.3924 4.6079 21.2020 9.8790 52.3665 10.3699 43.2913 6.5538 1.9365 0.6883 5.4885 10.9322 20.5373 5.8924 3.5333 2.6922 0.9137 41.7443 2.3779 1.1765 4.1542 6.8029 24.2582 8.9172 1.9511 10.1966 18.8029 49.7002 9.9723 8.7731 11.9571 78.5448 14.8116 36.2766 43.0361 32.6021 35.8007 15.9866 170.8128 4.5289 2.6242 2.4935 2.7256 34.7747 84.4182 20.6227 20.4849 10.7271 23.9014 14.8274 1.0253 4.4587 0.1873 2.1956 3.4446 12.3265 7.7467 8.7900 18.4389 15.7377 17.2044 248.2963 70.7333 3.8968 14.6751 11.9880 21.1573 44.4478 26.5604 57.9508 46.9778 8.1967 5.4017 6.6412 24.7237 46.0387 8.9139 89.7480 55.4913 9.1891 61.2694 42.1421 18.4444 11.6338 5.6660 86.9892
temp: 298.150 k
press: 1.00000 atm
elementType: 8 8 8 6 6 6 6 6 6 6 6 6 6 6 6 6 6 6 1 1 1 1 1 1 1 1 1 1 1 1 1 1 1 1 1 1 1 1 1 1
symmnumber: 1
zpe: 882283.3 jmol-1
zpe.correction: 0.336044 hartree
zpe.thermalcorrener: 0.355652 hartree
zpe.thermalcorrenthalpy: 0.356596 hartree
zpe.thermalcorrgfe: 0.287316 hartree
zpe.sumelectzpe: -809.064567 hartree
zpe.sumelectthermal: -809.044960 hartree
zpe.sumelectthermalent: -809.044015 hartree
zpe.sumelectthermalfe: -809.113295 hartree
dipole: -1.1497 -1.2888 -0.6537
dipole: 1.8467
quadrupole: -103.2772 -106.7459 -119.2364
quadrupole: 5.3934 -2.9702 -4.2329
quadrupole: 6.4759 3.0073 -9.4833 5.3934 -2.9702 -4.2329
hfenergy: -809.4006111 hartree
pointgroup: C01 [X(C15H22O3)]
dipole: 0.4514987 -0.5339907 0.1971002 debye
polarizability: 178.9675009|-28.956218|165.6538814|12.2500304|-10.9216163|179.3818165 unknown
InChI: InChI=1S/C15H22O3/c1-9(2)6-5-7-10(3)13-12(16)8-11(4)14(17)15(13)18/h8-10,18H,5-7H2,1-4H3
charge 0 multiplicity 1
40 atoms
O  1.114086 0.687168 2.250446
O  1.045258 0.897156 -2.576932
O  2.897069 -1.259704 2.041664
C  -1.406121 1.621052 0.489297
C  -0.050482 2.05405 -0.148821
C  -2.113119 0.47176 -0.262855
C  -3.48309 0.114463 0.357692
C  -4.291761 -0.960313 -0.417685
C  0.965835 0.92262 -0.162879
C  0.522536 3.314921 0.554884
C  -3.567093 -2.328187 -0.446326
C  -5.707419 -1.111629 0.188492
C  1.481825 0.321913 0.966261
C  1.460796 0.412374 -1.469992
C  2.49161 -0.784273 0.924607
C  2.467961 -0.693827 -1.512277
C  2.978523 -1.285351 -0.388035
C  3.991582 -2.401226 -0.38474
H  -2.06786 2.511526 0.496834
H  -1.241053 1.337195 1.546382
H  -0.241982 2.306447 -1.209392
H  -1.458131 -0.421971 -0.263657
H  -2.252836 0.758305 -1.326187
H  -4.095043 1.039206 0.422096
H  -3.334757 -0.232894 1.402831
H  -4.401207 -0.608228 -1.466295
H  -0.209193 4.141354 0.492639
H  0.731016 3.115781 1.620133
H  1.457857 3.651395 0.072046
H  -4.175541 -3.086308 -0.974236
H  -3.390064 -2.694864 0.584004
H  -2.589884 -2.267395 -0.958486
H  -6.311031 -1.84543 -0.377824
H  -6.250893 -0.147995 0.18581
H  -5.647037 -1.462778 1.237261
H  2.773832 -1.004616 -2.517843
H  4.273301 -2.689409 -1.410277
H  3.594407 -3.288773 0.141014
H  4.901658 -2.101921 0.166724
H  1.634544 0.100705 2.880621
