program: Gaussian 09
title: 000186118
version: EM64L-G09RevD.01
frameworkgroup: C1[X(C15H20N2O2)]
method: RPBEPBE
basis: SDD
operation: Freq
keyword: #p
keyword: freq=noraman
keyword: PBEPBE/SDD
title: #p freq=noraman PBEPBE/SDD
converged: NO YES NO NO
title: Mulliken charges:
elementType: O O N N C C C C C C C C C C C C C C C H H H H H H H H H H H H H H H H H H H H
charge: -0.436996 -0.291754 -0.112132 -0.216566 -0.112470 -0.020342 -0.256736 -0.553463 -0.401758 -0.504047 -0.417203 -0.387305 0.483450 -0.069043 -0.420845 -0.443651 0.127913 -0.148824 -0.343490 0.215177 0.188764 0.236358 0.240872 0.226400 0.185453 0.231924 0.238816 0.184575 0.252535 0.265199 0.220663 0.175738 0.182348 0.213902 0.228890 0.234896 0.331413 0.228772 0.242564
chargesum: 0.00000
title: Mulliken charges with hydrogens summed into heavy atoms:
elementType: O O N N C C C C C C C C C C C C C C C
charge: -0.105583 -0.291754 -0.112132 -0.216566 0.102708 0.168422 -0.020378 -0.086191 0.015619 -0.080656 0.100531 0.009096 0.483450 0.113305 0.021947 -0.208754 0.127913 0.079948 -0.100925
polarizability: 1.88900399e+02 3.66248721e-01 1.79021343e+02 2.09644814e+01 6.82928100e+00 1.48465977e+02
1716.lowfreq: -29.3696 -12.9374 -2.3884 -0.0004 0.0004 0.0005 32.0935 56.6411 79.3325
frequency: 32.0401 56.4759 79.2508 104.9024 168.7982 203.1771 214.9659 237.2901 250.0058 284.6196 291.0981 295.8145 335.5138 346.9379 357.8747 359.8382 420.1464 441.5418 464.1069 471.3641 494.8809 506.4563 531.3260 551.3764 592.2251 609.9008 642.5929 705.5143 711.8135 730.0432 765.8724 792.1052 807.6150 827.7643 853.1514 874.7461 889.1967 893.8714 914.2677 926.9339 957.2233 973.4457 977.1326 983.5929 1013.5240 1033.2690 1039.8883 1053.4977 1065.7928 1076.5837 1094.1554 1105.8855 1110.3715 1114.8813 1127.4380 1130.3532 1166.1549 1174.9063 1186.0655 1192.2002 1211.3058 1226.1838 1235.6725 1236.2865 1249.8507 1265.8954 1271.2589 1291.3690 1294.6441 1311.5861 1322.3604 1331.7255 1337.1447 1340.6550 1347.8686 1348.7197 1353.7794 1358.8043 1386.5692 1397.6417 1404.2876 1432.8465 1448.4732 1457.9381 1466.5601 1470.1053 1478.7089 1485.7404 1548.2986 1560.0078 1645.4218 2763.7303 2813.9313 2828.4791 2915.8896 2973.5653 2986.2626 2997.4424 3010.7097 3013.2411 3023.6718 3029.4447 3032.2298 3049.2418 3050.7788 3073.3754 3078.7717 3132.8299 3164.9123 3182.0298 3555.1744
redmass: 4.9749 4.7025 4.3822 3.2897 3.6569 4.4580 3.1126 3.6702 2.8474 2.4309 2.9269 1.1868 3.0779 2.5740 3.3642 3.7398 4.2492 4.0920 2.3051 3.3991 4.0177 3.9109 3.2279 4.5570 3.1101 4.5053 4.5253 3.6760 3.8453 2.1666 3.6261 1.9545 2.8843 2.0864 1.4856 2.9544 2.2333 2.8756 1.8176 2.0186 2.7248 1.7913 1.3102 2.6785 2.7652 2.3903 2.0344 2.1761 2.2518 1.6784 1.5704 2.0204 2.5222 2.4553 1.8238 1.6292 1.6543 1.3860 1.6514 2.0268 1.6195 1.7416 1.2327 1.2605 1.3539 1.3170 1.3578 1.6268 1.4914 1.4673 1.3570 1.4144 1.4930 1.4359 1.4552 1.4879 1.5467 1.4731 1.5248 2.1265 1.6042 1.7174 1.1006 1.0907 1.1036 1.0988 1.0974 1.4066 6.4324 7.4940 7.5666 1.0786 1.0710 1.0707 1.0832 1.0624 1.0644 1.0728 1.0634 1.0756 1.0866 1.0848 1.0857 1.1008 1.1023 1.0934 1.1034 1.0884 1.0935 1.0967 1.0660
irintensity: 0.0772 0.8469 3.0348 3.5224 4.6876 3.0164 0.5156 2.7987 2.5231 10.2388 3.1356 145.8808 4.3289 0.2252 5.5680 6.0309 2.2564 1.4031 5.0864 0.9706 1.0129 4.2796 1.9180 3.2841 5.5507 3.0454 1.2148 0.2668 4.6713 18.7038 6.5493 64.1270 2.0996 1.1824 1.9311 0.2708 1.1291 1.6168 1.0974 1.2771 14.2904 8.0696 0.3951 55.8639 26.5515 23.8148 3.3687 3.5163 0.4122 22.7213 21.0433 35.5272 13.9808 23.5178 37.4460 2.7867 17.0536 14.4143 12.7806 3.3004 3.0368 6.0882 12.7380 3.4030 23.6908 28.1502 1.0519 20.3281 1.9204 3.5077 10.8031 5.7851 5.7265 4.6236 3.0226 10.1736 50.6780 4.5842 3.3630 5.5368 3.9084 18.2763 5.0314 8.5399 9.2265 7.7648 7.5094 11.8831 112.4492 165.4320 222.2642 71.2637 39.4206 216.0323 70.1144 30.5447 22.9825 18.1272 14.6212 57.0373 16.8162 36.5186 46.1187 14.4174 49.9941 10.0371 36.0119 19.4891 8.3605 7.6469 3.4193
temp: 298.150 k
press: 1.00000 atm
elementType: 8 8 7 7 6 6 6 6 6 6 6 6 6 6 6 6 6 6 6 1 1 1 1 1 1 1 1 1 1 1 1 1 1 1 1 1 1 1 1
symmnumber: 1
zpe: 866139.4 jmol-1
zpe.correction: 0.329895 hartree
zpe.thermalcorrener: 0.345531 hartree
zpe.thermalcorrenthalpy: 0.346475 hartree
zpe.thermalcorrgfe: 0.287463 hartree
zpe.sumelectzpe: -842.117642 hartree
zpe.sumelectthermal: -842.102006 hartree
zpe.sumelectthermalent: -842.101062 hartree
zpe.sumelectthermalfe: -842.160074 hartree
dipole: 1.7487 -6.0408 2.0926
dipole: 6.6278
quadrupole: -114.1227 -122.2028 -107.2392
quadrupole: 7.2716 12.3028 3.5411
quadrupole: 0.3989 -7.6812 7.2824 7.2716 12.3028 3.5411
hfenergy: -842.4475367 hartree
pointgroup: C01 [X(C15H20N2O2)]
dipole: -0.7562191 -2.4177005 -0.6183371 debye
polarizability: 189.0497332|1.0725461|177.5863658|20.579458|-9.8772011|149.7516201 unknown
InChI: InChI=1S/C15H20N2O2/c18-12-4-5-16-8-10-6-11(14(16)7-12)9-17-13(10)2-1-3-15(17)19/h1-3,10-12,14,18H,4-9H2
charge 0 multiplicity 1
39 atoms
O  -4.458086 1.894614 0.330274
O  2.222925 2.695181 -0.52932
N  -1.19352 -0.859864 0.533328
N  1.618503 0.423006 -0.429188
C  -0.41481 -0.336047 -1.79061
C  -1.63802 -0.476151 -0.833743
C  0.855684 -1.960585 -0.424417
C  0.345346 -1.678318 -1.85336
C  -0.365052 -2.086221 0.528867
C  -2.501798 0.804689 -0.783555
C  0.571057 0.793209 -1.427822
C  -2.321597 -1.0026 1.492149
C  1.803007 -0.866154 0.043416
C  -3.694054 0.644624 0.180613
C  -3.17719 0.273128 1.57428
C  2.829583 -1.132251 0.949372
C  2.448919 1.54442 -0.02626
C  3.67177 -0.070563 1.401792
C  3.485946 1.224757 0.935209
H  -0.826029 -0.08964 -2.789236
H  -2.277263 -1.298139 -1.269334
H  1.404715 -2.918964 -0.388591
H  1.183675 -1.625493 -2.572941
H  -0.33053 -2.490986 -2.181161
H  -0.958965 -2.983326 0.204076
H  -0.016955 -2.273165 1.561474
H  -1.900912 1.66228 -0.429322
H  -2.856449 1.035054 -1.809507
H  1.105054 1.138415 -2.333548
H  0.058721 1.686211 -1.034549
H  -1.896929 -1.234102 2.4865
H  -2.977258 -1.868188 1.204966
H  -4.362541 -0.165194 -0.195376
H  -4.027106 0.115265 2.262553
H  -2.573077 1.113129 1.962411
H  2.97181 -2.157342 1.301718
H  -4.773862 2.189501 -0.561713
H  4.472349 -0.283611 2.119418
H  4.113341 2.059023 1.260141
