program: Gaussian 09
title: 000186115
version: EM64L-G09RevD.01
frameworkgroup: C1[X(C13H23N3S)]
method: RPBEPBE
basis: SDD
operation: Freq
keyword: #p
keyword: freq=noraman
keyword: PBEPBE/SDD
title: #p freq=noraman PBEPBE/SDD
converged: YES YES NO NO
title: Mulliken charges:
elementType: S N N N C C C C C C C C C C C C C H H H H H H H H H H H H H H H H H H H H H H H
charge: 0.172510 -0.277896 -0.723963 -0.697924 -0.018644 -0.041235 0.054941 -0.712186 -0.707844 -0.723195 -0.723419 0.462365 0.429591 -0.431016 -0.508478 -0.175919 -0.871264 0.159699 0.205572 0.204180 0.219845 0.253057 0.221022 0.212601 0.208490 0.239580 0.206417 0.235424 0.211301 0.216474 0.225656 0.221352 0.230618 0.297271 0.330598 0.291440 0.322596 0.261131 0.258588 0.260666
chargesum: 0.00000
title: Mulliken charges with hydrogens summed into heavy atoms:
elementType: S N N N C C C C C C C C C C C C C
charge: 0.172510 -0.277896 -0.096095 -0.083888 0.141054 0.164337 0.054941 -0.035103 -0.065732 -0.041773 -0.069988 0.462365 0.429591 -0.209665 -0.277859 -0.175919 -0.090879
polarizability: 2.47380826e+02 -3.63562922e+00 1.75587411e+02 1.73543020e+00 -1.46650597e+01 1.36271824e+02
1716.lowfreq: -12.1073 -7.0338 -0.0015 -0.0003 0.0011 4.4155 26.5706 28.4900 47.9842
frequency: 26.1963 27.8667 47.9516 54.2936 81.4881 118.2103 152.1202 162.8777 175.2665 178.9907 211.3767 220.9835 227.2477 238.5849 243.4469 256.1334 258.9029 270.6009 290.6969 309.1659 310.2201 326.0400 340.1212 384.8158 397.5131 415.2911 416.1365 441.2730 449.7564 511.8149 527.6870 541.5064 568.8389 576.7712 597.8193 614.9733 618.7011 675.5238 742.0646 787.4947 809.8289 825.9026 843.3520 872.5440 907.8750 916.2920 922.3031 941.4046 951.7150 966.1212 981.0549 1001.1735 1008.8495 1011.6242 1108.1432 1117.2351 1120.8167 1125.9367 1134.0881 1154.1293 1175.8449 1182.4758 1240.9389 1261.3270 1313.6243 1325.7732 1335.8307 1343.7141 1360.3965 1364.4499 1369.4072 1376.8151 1387.5795 1393.4463 1394.9688 1439.6060 1451.9509 1460.5796 1462.7756 1466.1583 1466.8379 1472.3427 1476.8929 1482.8569 1487.9864 1493.6070 1504.1472 1560.4974 1588.4752 1599.8195 1624.3892 2826.9213 2960.5565 2967.8819 2976.0974 2987.0829 2987.5982 3003.3900 3057.2363 3072.0059 3074.1933 3076.4159 3082.1824 3082.7315 3095.4566 3100.3778 3118.4312 3128.8864 3129.8567 3141.0679 3512.4527 3573.5075 3693.1888 3717.9572
redmass: 2.6047 3.0898 4.9475 3.0167 3.5825 3.8043 3.9260 3.3716 3.1622 3.6068 2.2604 1.2916 1.1627 1.4243 1.8056 1.4782 1.3731 2.6901 2.0043 1.1705 1.1688 2.7288 2.6029 2.6645 2.1577 1.8382 1.6885 3.1256 2.7689 4.3827 4.5015 3.1094 1.5634 3.0719 3.0371 3.2239 2.0000 7.0230 2.2498 1.7776 2.1196 3.4398 3.1017 4.0363 1.2284 1.2469 1.9150 1.4756 1.5810 1.1762 1.3996 2.4509 1.7330 1.7192 1.6503 2.2067 2.1579 2.1915 1.9917 2.3005 2.0407 2.4159 2.9739 1.3232 1.4011 1.4854 1.2326 1.1572 1.3370 2.4263 1.4236 1.2670 5.4642 1.2124 1.2506 3.6600 1.0530 1.0531 1.0596 1.0647 1.0889 1.0624 1.0585 1.0581 1.0627 1.0880 2.9646 1.4040 5.0598 4.2060 1.2254 1.0805 1.0813 1.0353 1.0370 1.0360 1.0363 1.0289 1.0984 1.0998 1.1003 1.0995 1.0990 1.0992 1.1000 1.0991 1.1061 1.1013 1.0915 1.0903 1.0464 1.0443 1.1009 1.1039
irintensity: 0.0461 2.4577 0.1835 0.0767 0.0751 0.3622 1.4752 0.2503 0.9086 0.5088 0.3521 0.9847 36.7504 1.8942 18.7674 4.4897 15.1189 5.6508 53.5287 16.2064 255.8950 9.0072 7.8777 17.7222 4.3508 15.5463 6.1034 2.9722 3.4345 0.2270 0.8540 1.2801 49.7773 5.5043 4.3305 2.3345 17.4059 0.6714 1.4953 9.3687 67.4585 10.4301 5.9354 46.0825 6.0936 1.3217 9.6137 2.5289 3.6485 9.8748 11.1512 3.2342 19.7329 3.4228 2.8440 2.3200 20.6562 25.5895 17.9244 14.1217 16.7052 53.3594 113.7010 19.1733 9.4813 10.2985 28.5161 0.2182 8.3959 14.8693 17.6158 11.4160 0.9230 43.0097 6.0131 51.8578 14.2928 6.9532 19.4350 20.2673 17.4264 0.7057 5.1728 4.7799 16.4313 10.8490 53.1458 33.1342 168.9322 380.2945 168.9091 84.6972 27.7366 30.9366 43.0181 51.0405 6.8657 29.5487 40.1438 10.8889 18.8787 23.1788 70.5152 78.8597 21.2303 27.3067 21.3555 9.6223 11.4097 8.3324 49.2108 41.2073 43.1216 29.4636
temp: 298.150 k
press: 1.00000 atm
elementType: 16 7 7 7 6 6 6 6 6 6 6 6 6 6 6 6 6 1 1 1 1 1 1 1 1 1 1 1 1 1 1 1 1 1 1 1 1 1 1 1
symmnumber: 1
zpe: 895692.8 jmol-1
zpe.correction: 0.341151 hartree
zpe.thermalcorrener: 0.361925 hartree
zpe.thermalcorrenthalpy: 0.362869 hartree
zpe.thermalcorrgfe: 0.292312 hartree
zpe.sumelectzpe: -1070.156818 hartree
zpe.sumelectthermal: -1070.136044 hartree
zpe.sumelectthermalent: -1070.135100 hartree
zpe.sumelectthermalfe: -1070.205657 hartree
dipole: 2.3860 1.7690 -0.8877
dipole: 3.1001
quadrupole: -107.8926 -99.0296 -114.8092
quadrupole: -7.7368 2.8415 -6.2831
quadrupole: -0.6488 8.2142 -7.5654 -7.7368 2.8415 -6.2831
hfenergy: -1070.4979691 hartree
pointgroup: C01 [X(C13H23N3S1)]
dipole: 0.9484444 0.5247203 -0.5591856 debye
polarizability: 247.1518767|-5.8527773|163.5114767|0.7609999|-23.409928|148.5767073 unknown
InChI: InChI=1S/C13H23N3S/c1-8(2)16(9(3)4)13-11(14)6-10(17-5)7-12(13)15/h6-9H,14-15H2,1-5H3
charge 0 multiplicity 1
40 atoms
S  -4.465515 -0.242444 0.450415
N  1.661341 -0.119012 0.13522
N  0.055834 1.826817 -1.380441
N  0.290523 -2.023554 1.590559
C  2.352863 -0.560807 -1.120501
C  2.436216 0.78043 1.060166
C  0.210892 -0.073456 0.157817
C  1.474555 -1.550694 -1.915258
C  3.723444 -1.211717 -0.808234
C  1.656541 1.056105 2.362356
C  2.900612 2.126851 0.428801
C  -0.568841 0.873157 -0.570628
C  -0.476266 -1.072452 0.923582
C  -1.993873 0.851354 -0.503353
C  -1.894578 -1.093019 0.995478
C  -2.635523 -0.125145 0.282424
C  -5.072125 1.163829 -0.629939
H  2.560754 0.308218 -1.797484
H  3.355172 0.225049 1.339297
H  2.017359 -1.878457 -2.820458
H  1.240677 -2.441473 -1.304184
H  0.522253 -1.092571 -2.228509
H  4.431168 -0.510632 -0.331479
H  4.189112 -1.566304 -1.7460
H  3.588995 -2.08103 -0.13714
H  1.355574 0.118124 2.859205
H  2.294233 1.633824 3.056454
H  0.743041 1.6433 2.16267
H  3.40834 1.974741 -0.543123
H  3.624047 2.625869 1.100787
H  2.04613 2.81294 0.285789
H  -2.561529 1.597028 -1.069272
H  -2.403727 -1.85857 1.591695
H  -0.495536 2.488457 -1.917292
H  1.067422 1.862679 -1.444429
H  -0.136276 -2.786965 2.104331
H  1.298894 -1.978037 1.443344
H  -4.70456 2.131475 -0.253523
H  -6.170642 1.134884 -0.558301
H  -4.768098 1.011605 -1.677644
