program: Gaussian 09
title: 000186108
version: EM64L-G09RevD.01
frameworkgroup: C1[X(C15H13ClOS2)]
method: RPBEPBE
basis: SDD
operation: Freq
keyword: #p
keyword: freq=noraman
keyword: PBEPBE/SDD
title: #p freq=noraman PBEPBE/SDD
converged: YES YES NO NO
title: Mulliken charges:
elementType: Cl S S O C C C C C C C C C C C C C C C H H H H H H H H H H H H H
charge: -0.053593 0.199918 0.071507 -0.161469 0.462126 0.486289 -0.423097 -0.820690 -0.342046 -0.421977 -0.371832 -0.373661 -0.205186 -0.203647 -0.218530 -0.218520 -0.101919 -0.233130 -0.374065 0.250764 0.249072 0.304419 0.305317 0.265045 0.239097 0.239425 0.238923 0.259001 0.258466 0.230573 0.230623 0.232795
chargesum: 0.00000
title: Mulliken charges with hydrogens summed into heavy atoms:
elementType: Cl S S O C C C C C C C C C C C C C C C
charge: -0.053593 0.199918 0.071507 -0.161469 0.462126 0.486289 0.076739 -0.210954 -0.077001 -0.182880 -0.132407 -0.134738 0.053815 0.054819 0.012043 0.012102 -0.101919 -0.000335 -0.374065
polarizability: 3.25168597e+02 -2.16916109e+01 1.94020042e+02 6.33561608e-01 1.42733219e+01 1.38282355e+02
1716.lowfreq: -6.7650 -4.1106 -2.6293 0.0015 0.0020 0.0020 8.2806 11.1666 24.7508
frequency: 7.7378 10.7653 24.7179 27.0852 28.4253 60.2570 74.3071 121.8204 126.2349 139.5893 146.8199 218.8267 249.1907 290.4573 324.5218 325.6682 350.3616 401.9852 406.1198 413.0533 426.9282 475.0114 488.4636 503.1318 553.6788 561.9986 616.4885 625.0456 649.1758 650.3800 702.2415 705.3773 777.1938 803.5188 809.0627 823.7417 833.1678 852.9801 868.4429 884.0117 928.5438 943.5684 969.1369 975.2558 978.7073 989.9896 992.6753 998.9244 1002.6744 1026.4103 1072.8031 1076.1677 1111.6230 1126.2585 1147.8980 1174.2282 1186.0116 1186.3461 1188.2047 1218.4143 1225.6924 1247.9330 1295.3095 1324.9931 1338.6592 1383.9021 1384.8897 1398.2176 1436.8642 1440.1712 1458.5130 1480.7736 1483.8542 1589.4924 1593.6618 1605.8101 1613.4364 2976.7422 3044.2173 3048.6886 3121.4344 3123.9601 3126.0496 3132.2208 3138.3800 3150.5139 3156.5221 3166.7920 3172.9596 3177.7151
redmass: 5.4465 4.0940 5.2067 5.1655 7.8836 8.1169 6.1903 8.4170 5.0423 8.2205 7.3852 7.0479 5.8206 6.0468 2.2265 3.9034 12.5576 2.7964 3.0161 6.6690 7.4963 3.7285 3.5061 12.0114 5.9489 8.9440 6.3330 7.0874 5.2143 5.4687 1.6472 3.7448 2.1780 2.1641 3.9013 2.1827 1.2835 1.2507 7.1489 1.5360 1.4498 1.3380 1.4187 5.4260 1.3918 5.8828 2.0662 1.3227 3.9086 2.2005 2.7405 1.5059 1.3483 1.0734 6.5724 1.0527 1.1291 1.1259 1.1118 2.1963 2.3146 1.4148 1.2686 1.2798 1.8155 5.0367 8.7993 2.4421 1.1127 2.1994 1.0959 2.4959 2.3456 7.4478 6.0926 6.1788 6.1258 1.0580 1.0579 1.1044 1.1070 1.0855 1.0899 1.0902 1.0919 1.0964 1.0890 1.1017 1.0955 1.0974
irintensity: 0.2044 0.8224 1.4587 0.0869 0.1418 0.4942 3.0830 0.0928 4.2779 4.1346 1.9298 1.5931 0.2403 0.6089 0.8754 1.5751 0.2994 0.0003 6.2528 12.8294 21.3600 11.6757 30.1427 0.8215 31.6423 17.5181 0.1143 0.9010 10.3669 42.8226 61.7407 5.2085 26.3261 34.6154 12.0570 56.1107 8.2962 0.0072 13.8165 0.4962 3.9362 4.8084 15.5482 440.3725 0.0139 0.5559 71.4711 0.0951 9.6029 3.5827 51.0802 8.5651 7.7135 1.9187 555.2360 0.0214 4.3118 4.6724 0.7667 11.3889 5.9553 25.6728 4.3014 0.1928 15.4157 2.7560 0.3327 4.3445 13.8621 8.7782 26.4542 73.7723 10.0321 1.5089 1.1136 12.1805 0.8327 12.3840 2.2368 11.1817 0.7190 6.0359 2.0220 9.3843 12.5490 35.7449 2.4039 23.4918 4.7902 0.6568
temp: 298.150 k
press: 1.00000 atm
elementType: 17 16 16 8 6 6 6 6 6 6 6 6 6 6 6 6 6 6 6 1 1 1 1 1 1 1 1 1 1 1 1 1
symmnumber: 1
zpe: 619008.8 jmol-1
zpe.correction: 0.235768 hartree
zpe.thermalcorrener: 0.254325 hartree
zpe.thermalcorrenthalpy: 0.255270 hartree
zpe.thermalcorrgfe: 0.181890 hartree
zpe.sumelectzpe: -1909.433933 hartree
zpe.sumelectthermal: -1909.415376 hartree
zpe.sumelectthermalent: -1909.414432 hartree
zpe.sumelectthermalfe: -1909.487812 hartree
dipole: 3.1936 -3.5964 0.4600
dipole: 4.8316
quadrupole: -131.8632 -137.3930 -126.3054
quadrupole: -5.5284 0.3062 6.4841
quadrupole: -0.0093 -5.5392 5.5485 -5.5284 0.3062 6.4841
hfenergy: -1909.6697014 hartree
pointgroup: C01 [X(C15H13Cl1O1S2)]
dipole: 1.2852458 1.2428689 -0.6456353 debye
polarizability: 325.1599112|21.5784621|196.1462775|2.3780735|-9.0542323|136.1648052 unknown
InChI: InChI=1S/C15H13ClOS2/c16-14-8-6-12(7-9-14)10-17-15(18)19-11-13-4-2-1-3-5-13/h1-9H,10-11H2
charge 0 multiplicity 1
32 atoms
Cl -7.689408 0.423396 -0.759491
S  1.326815 -0.059105 0.258999
S  0.498057 -2.748462 1.65051
O  -1.207239 -0.962292 0.680055
C  -3.090187 0.305079 -0.187398
C  4.129634 -0.030137 0.339947
C  -1.58506 0.291712 -0.055061
C  2.975175 -0.90775 0.755101
C  -3.805295 -0.881853 -0.484632
C  -3.797187 1.524608 -0.056469
C  4.639602 0.955938 1.224279
C  4.728781 -0.182542 -0.937544
C  -5.205937 -0.853145 -0.6555
C  -5.198268 1.572643 -0.235859
C  5.728315 1.769957 0.841586
C  5.817859 0.630276 -1.322009
C  -5.880004 0.378151 -0.534216
C  6.320143 1.609235 -0.43311
C  0.116428 -1.30132 0.882631
H  -1.083013 0.262868 -1.042832
H  -1.216222 1.167771 0.509492
H  2.965606 -1.888804 0.255712
H  2.909408 -1.063947 1.842987
H  -3.268296 -1.832671 -0.556208
H  -3.260979 2.44913 0.188211
H  4.183554 1.081123 2.21375
H  4.341638 -0.941584 -1.627929
H  -5.761203 -1.769012 -0.876429
H  -5.74471 2.514587 -0.1360
H  6.116347 2.524148 1.535068
H  6.275106 0.499425 -2.308963
H  7.166441 2.238777 -0.729678
