program: Gaussian 09
title: 000186125
version: EM64L-G09RevD.01
frameworkgroup: C1[X(C12H17ClN2O2)]
method: RPBEPBE
basis: SDD
operation: Freq
keyword: #p
keyword: freq=noraman
keyword: PBEPBE/SDD
title: #p freq=noraman PBEPBE/SDD
converged: YES YES NO NO
title: Mulliken charges:
elementType: Cl O O N N C C C C C C C C C C C C H H H H H H H H H H H H H H H H H
charge: -0.046642 -0.319495 -0.275549 -0.236746 -0.374409 0.110733 0.440091 0.446028 -0.624976 -0.554072 0.514789 -0.812620 -0.821855 -0.630424 -0.635454 0.300137 -0.607127 0.308290 0.242631 0.234256 0.249767 0.226687 0.237183 0.232633 0.234011 0.217837 0.206697 0.208105 0.213321 0.242889 0.339417 0.231518 0.270897 0.231452
chargesum: 0.00000
title: Mulliken charges with hydrogens summed into heavy atoms:
elementType: Cl O O N N C C C C C C C C C C C C
charge: -0.046642 -0.319495 -0.275549 -0.236746 -0.034993 0.110733 0.440091 0.446028 -0.624976 -0.245782 0.514789 -0.085966 -0.125352 0.028120 0.028861 0.300137 0.126740
polarizability: 2.44480729e+02 -1.06268800e+01 1.77474198e+02 6.07131305e-01 -4.95717470e-01 9.23196478e+01
1716.lowfreq: -13.2717 -0.0015 0.0016 0.0017 4.0404 7.6182 13.1179 29.0577 37.4910
frequency: 8.8485 28.0350 37.1228 78.9904 83.7699 92.4335 95.5897 123.2397 145.3883 157.0046 172.2601 184.3720 191.8378 207.4757 211.4946 226.2509 239.9276 270.8864 293.1338 301.3795 322.2903 339.4500 351.8367 393.9950 448.0799 492.7831 528.6694 549.9549 595.9856 603.2259 636.4558 651.4702 682.4084 692.6821 718.4230 759.2593 858.7076 903.2766 948.7826 970.6318 985.2084 1020.6161 1029.3368 1041.9973 1046.4016 1060.4493 1088.5009 1101.0163 1126.8282 1131.3045 1140.6595 1150.5114 1186.7562 1208.0564 1231.8660 1297.3454 1341.0303 1348.7572 1387.5388 1397.1201 1407.6941 1423.2353 1425.8510 1432.6017 1447.8551 1454.8354 1459.2333 1462.0448 1464.0112 1475.5003 1477.8800 1482.4788 1483.6937 1493.8899 1513.8838 1515.8579 1561.4954 1597.1233 1691.5253 2893.5667 2903.9583 2976.4836 2978.7620 2980.2573 2981.8259 2983.6318 3058.0083 3059.8857 3061.9570 3082.1499 3087.7546 3090.8487 3103.1036 3114.1090 3188.3506 3573.0852
redmass: 3.9686 3.0292 2.9722 3.6859 3.4946 4.1107 1.1035 2.1988 1.1987 2.8512 1.8988 1.1839 2.8971 1.1423 3.4788 4.1213 4.1199 3.6625 3.2185 4.1552 3.6304 4.5337 4.9823 3.6263 5.0332 4.0327 3.3481 5.0206 5.2936 1.1171 5.3107 6.3633 11.4360 5.8366 4.7015 4.5114 4.5416 1.3400 2.8408 2.9244 4.7555 2.2079 1.6512 1.5218 1.5248 1.4322 1.3101 3.4478 1.2832 1.3761 2.4323 1.8176 2.1793 1.7658 4.4313 4.9462 7.8094 3.8920 1.3102 1.2608 3.1056 1.7588 1.2187 1.1815 1.1921 1.0685 1.2298 1.1590 1.1010 1.0956 1.1367 1.1173 1.0435 1.1245 1.2854 1.2751 7.3325 6.9234 9.1939 1.0489 1.0493 1.0802 1.0417 1.0446 1.0355 1.0856 1.0952 1.1027 1.0922 1.0950 1.0951 1.0995 1.0999 1.0983 1.0920 1.0774
irintensity: 1.3771 8.2809 4.3582 0.9856 1.7406 1.2902 0.4297 2.5135 1.0982 0.3203 4.4579 0.8725 0.9632 0.6953 0.7536 2.0208 1.8230 0.8085 3.5078 2.7738 11.4858 17.4405 8.0440 2.7043 5.5139 0.4593 3.1996 2.8534 7.1636 131.3779 1.9848 0.2117 28.7835 6.0180 11.6390 0.7961 19.9893 23.9860 62.3861 15.9480 58.7274 29.0804 5.4392 3.8191 8.9391 12.1880 134.5610 516.2992 0.0093 1.0144 13.8560 19.3105 399.2619 34.5808 25.5840 45.7165 47.1474 37.8730 26.4257 21.1835 8.5178 145.9722 12.8955 19.0647 48.5467 14.2953 190.7564 26.8986 22.9650 30.7059 42.3801 48.1075 16.4731 55.2031 192.7528 6.7710 8.1240 2.4164 226.0568 88.0820 212.1743 81.3006 38.6006 54.0724 85.5270 21.8736 17.5001 36.3631 16.7503 20.0599 31.7547 20.4138 4.4638 4.0408 6.3446 43.6970
temp: 298.150 k
press: 1.00000 atm
elementType: 17 8 8 7 7 6 6 6 6 6 6 6 6 6 6 6 6 1 1 1 1 1 1 1 1 1 1 1 1 1 1 1 1 1
symmnumber: 1
zpe: 713617.5 jmol-1
zpe.correction: 0.271803 hartree
zpe.thermalcorrener: 0.291583 hartree
zpe.thermalcorrenthalpy: 0.292527 hartree
zpe.thermalcorrgfe: 0.221203 hartree
zpe.sumelectzpe: -1186.187953 hartree
zpe.sumelectthermal: -1186.168172 hartree
zpe.sumelectthermalent: -1186.167228 hartree
zpe.sumelectthermalfe: -1186.238553 hartree
dipole: 0.4058 0.0628 0.0918
dipole: 0.4208
quadrupole: -76.6943 -112.0922 -109.1742
quadrupole: -6.9666 0.7632 1.0297
quadrupole: 22.6260 -12.7720 -9.8540 -6.9666 0.7632 1.0297
hfenergy: -1186.4597551 hartree
pointgroup: C01 [X(C12H17Cl1N2O2)]
dipole: -0.1593999 -0.0260655 0.0363059 debye
polarizability: 245.2002643|-6.8156565|174.3215914|5.1574061|-13.8303338|94.7527187 unknown
InChI: InChI=1S/C12H17ClN2O2/c1-7-6-9(17-12(16)14-3)10(13)8(2)11(7)15(4)5/h6,14H,1-5H3
charge 0 multiplicity 1
34 atoms
Cl 0.907039 -2.932715 0.383691
O  2.243991 -0.383214 0.027203
O  3.015468 1.868266 -0.248988
N  -3.421969 0.012249 -0.240255
N  4.447946 0.025802 0.03744
C  -1.993114 -0.030024 -0.172808
C  -1.353523 -1.303755 0.025787
C  -1.199204 1.151116 -0.306628
C  0.055131 -1.337678 0.100757
C  0.21186 1.063625 -0.272132
C  0.848443 -0.176579 -0.059001
C  -2.171826 -2.574976 0.110107
C  -1.837498 2.524472 -0.432274
C  -4.113576 0.642009 -1.368131
C  -4.221809 -0.203465 0.9711
C  3.22639 0.643134 -0.080453
C  5.706322 0.771996 -0.019688
H  0.823821 1.961776 -0.370715
H  -1.668436 -3.405702 -0.412252
H  -2.32011 -2.901069 1.15803
H  -3.163432 -2.40169 -0.338696
H  -2.699679 2.624238 0.251083
H  -1.108431 3.314985 -0.187664
H  -2.209879 2.723646 -1.455235
H  -3.453015 0.657113 -2.251042
H  -5.013723 0.048183 -1.630872
H  -4.451913 1.685051 -1.16972
H  -4.517476 0.751097 1.46627
H  -5.151855 -0.759688 0.733996
H  -3.647639 -0.795004 1.702945
H  4.44453 -0.986052 0.171112
H  6.276889 0.667273 0.921517
H  5.465689 1.836276 -0.169631
H  6.33669 0.429805 -0.861056
