program: Gaussian 09
title: 000186048
version: EM64L-G09RevD.01
frameworkgroup: C1[X(C13H14ClN3O2S)]
method: RPBEPBE
basis: SDD
operation: Freq
keyword: #p
keyword: freq=noraman
keyword: PBEPBE/SDD
title: #p freq=noraman PBEPBE/SDD
converged: YES YES NO NO
title: Mulliken charges:
elementType: Cl S O O N N N C C C C C C C C C C C C C H H H H H H H H H H H H H H
charge: -0.057840 0.708173 -0.630815 -0.277913 -0.461492 -0.141846 -0.060264 0.431109 -0.413608 0.262406 0.087473 -0.187464 -0.815990 -0.669539 -0.636321 -0.204660 -0.222256 -0.208463 -0.207258 -0.091965 0.341286 0.246406 0.343864 0.218655 0.258020 0.239468 0.238451 0.315284 0.228467 0.230077 0.315222 0.300918 0.262117 0.260300
chargesum: 0.00000
title: Mulliken charges with hydrogens summed into heavy atoms:
elementType: Cl S O O N N N C C C C C C C C C C C C C
charge: -0.057840 0.708173 -0.630815 -0.277913 -0.120206 -0.141846 -0.060264 0.431109 -0.413608 0.262406 0.087473 -0.187464 -0.007065 0.066400 0.137508 0.110561 0.078662 0.053654 0.053042 -0.091965
polarizability: 2.81996286e+02 -6.29192623e-01 1.86134894e+02 5.37479221e+00 -1.94492887e+01 1.57952901e+02
1716.lowfreq: -0.0009 0.0009 0.0023 3.0489 3.8625 5.6154 21.2610 32.4868 60.1735
frequency: 21.2430 32.4811 60.1390 67.8991 80.4131 104.0071 115.1163 130.9569 145.5947 153.2358 163.7353 173.1820 200.3982 209.0919 229.9765 242.7489 252.6790 272.9005 280.8154 318.2808 335.6441 359.5003 398.8698 414.6300 416.9034 429.5467 472.5542 508.0720 513.4703 546.7665 555.7886 564.6384 575.1779 614.7818 634.0156 693.1021 693.7658 709.4876 755.6416 780.4960 841.2126 844.7418 866.2419 927.1731 976.2838 980.1415 988.6574 990.0947 1033.5159 1044.3913 1056.6903 1062.0994 1063.4912 1087.4562 1095.2043 1100.6618 1137.8282 1149.1190 1172.9748 1218.1349 1270.5299 1280.8228 1303.1588 1373.4327 1376.1740 1376.9865 1403.8681 1408.2408 1418.0895 1446.6061 1447.5194 1455.9870 1475.8696 1483.5331 1493.7733 1496.5905 1501.3856 1533.0155 1567.6619 1590.6158 1606.2046 1643.8149 2941.3684 2943.6307 2975.2942 3012.4365 3040.6622 3056.4043 3056.9512 3112.2875 3121.2839 3124.2043 3150.6909 3168.9125 3173.4666 3534.7538
redmass: 6.8058 4.1721 3.9403 2.9693 4.4477 2.1679 3.4276 2.3160 2.5291 1.7184 6.0545 1.3137 2.4799 7.1584 5.1448 5.4470 6.3673 6.7001 5.5463 3.1380 7.2064 4.6027 7.4947 3.0959 5.4934 4.1193 8.7701 3.5990 7.8165 1.6180 4.7684 2.3727 4.8406 7.1236 6.1251 9.9254 7.7268 4.2661 10.2814 17.3008 1.3302 1.3196 5.2994 7.2904 1.3252 5.1834 2.2363 1.3861 3.4071 2.7628 1.5005 1.4852 3.0963 2.3361 1.2304 1.3317 1.3350 3.1746 1.1403 3.1689 5.2754 1.2405 2.3254 3.2428 3.0002 9.1974 1.6773 2.0880 1.1476 1.1796 2.1141 1.1115 1.1143 1.0453 1.0494 1.0465 1.1713 7.0730 6.0586 8.1776 4.3009 6.4428 1.0402 1.0389 1.0354 1.1020 1.0965 1.1027 1.0987 1.0942 1.0983 1.0899 1.0910 1.0946 1.0964 1.0771
irintensity: 1.3125 4.6839 0.6687 0.0492 7.1018 0.7404 0.2264 2.8687 5.0062 1.7276 4.8521 0.6619 0.5588 3.4767 5.0437 12.6642 2.6656 2.1720 0.0570 4.9702 12.3746 2.7519 36.3449 0.0440 15.6267 5.5833 3.3195 57.3958 0.7722 53.3877 6.3000 17.8339 3.4015 0.5274 12.9088 21.9995 15.4368 2.8668 25.9926 51.8853 50.4179 30.2215 13.8465 44.2480 6.2586 52.0163 6.2743 4.2937 32.8306 8.3605 4.0252 33.9419 32.8239 16.1049 0.1771 8.4998 0.0865 8.5952 27.3935 72.1915 19.6003 4.6499 157.5389 64.7053 4.6045 8.0567 93.0835 27.3598 32.1181 23.7395 134.1297 4.4360 47.4794 26.8330 25.3634 5.3393 55.9681 491.6566 9.2142 1.1567 628.3731 260.1526 60.6784 79.8095 95.4496 33.1796 10.9068 30.4926 15.9181 10.8598 0.2375 9.8942 13.6723 2.8097 9.1783 28.4924
temp: 298.150 k
press: 1.00000 atm
elementType: 17 16 8 8 7 7 7 6 6 6 6 6 6 6 6 6 6 6 6 6 1 1 1 1 1 1 1 1 1 1 1 1 1 1
symmnumber: 1
zpe: 659322.3 jmol-1
zpe.correction: 0.251123 hartree
zpe.thermalcorrener: 0.271607 hartree
zpe.thermalcorrenthalpy: 0.272551 hartree
zpe.thermalcorrgfe: 0.200837 hartree
zpe.sumelectzpe: -1675.066008 hartree
zpe.sumelectthermal: -1675.045525 hartree
zpe.sumelectthermalent: -1675.044580 hartree
zpe.sumelectthermalfe: -1675.116294 hartree
dipole: -8.0645 -1.2882 -6.6311
dipole: 10.5198
quadrupole: -101.3204 -141.2491 -132.7132
quadrupole: 3.8862 17.9892 -3.4321
quadrupole: 23.7738 -16.1549 -7.6190 3.8862 17.9892 -3.4321
hfenergy: -1675.3171311 hartree
pointgroup: C01 [X(C13H14Cl1N3O2S1)]
dipole: 3.3903614 0.4319588 -2.3342218 debye
polarizability: 281.7864651|3.3658912|190.221961|5.9674457|15.9866845|154.0756544 unknown
InChI: InChI=1S/C13H14ClN3O2S/c1-8-11(12(18)16-13(15-8)17(2)3)20(19)10-6-4-9(14)5-7-10/h4-7,15H,1-3H3
charge 0 multiplicity 1
34 atoms
Cl -5.624501 1.395208 -1.205752
S  -0.76376 -1.637524 1.872699
O  -0.819407 -3.136708 1.117214
O  0.222242 0.975447 2.831088
N  2.699144 -0.363839 -0.11157
N  4.182328 1.439115 0.327315
N  2.221685 1.222176 1.625513
C  1.546046 -1.128378 0.156895
C  0.74114 -0.688592 1.182121
C  3.01061 0.778163 0.643841
C  1.030137 0.546748 1.941529
C  -2.141301 -0.662979 0.958319
C  1.330994 -2.321067 -0.739633
C  5.073778 0.968618 -0.742677
C  4.562399 2.649379 1.081285
C  -2.485959 0.647041 1.341949
C  -2.829495 -1.37564 -0.036764
C  -3.557971 1.280513 0.669469
C  -3.89922 -0.741866 -0.709324
C  -4.239542 0.575808 -0.34355
H  3.31028 -0.678611 -0.867238
H  0.977727 -1.993396 -1.736211
H  0.560329 -2.979089 -0.296388
H  2.270206 -2.890259 -0.874615
H  5.947544 1.635656 -0.78833
H  4.587092 0.996657 -1.739364
H  5.454363 -0.055927 -0.551809
H  3.768324 2.853946 1.814362
H  4.666056 3.513069 0.398539
H  5.518917 2.49093 1.613776
H  -1.92684 1.162281 2.129583
H  -2.527219 -2.407478 -0.256472
H  -3.853528 2.299526 0.934648
H  -4.458998 -1.263723 -1.490747
