program: Gaussian 09
title: 000186039
version: EM64L-G09RevD.01
frameworkgroup: C1[X(C9H9NS)]
method: RPBEPBE
basis: SDD
operation: Freq
keyword: #pfreq=noraman
keyword: PBEPBE/SDD
title: #p freq=noraman PBEPBE/SDD
converged: NO NO NO NO
title: Mulliken charges:
elementType: S N C C C C C C C C C H H H H H H H H H
charge: 0.287613 0.008091 0.474047 0.435870 -0.357971 -0.357631 -0.373479 -0.373229 -0.808041 -0.800441 -0.364386 0.238269 0.238321 0.235247 0.235241 0.292545 0.292594 0.228102 0.228076 0.241163
chargesum: 0.00000
title: Mulliken charges with hydrogens summed into heavy atoms:
elementType: S N C C C C C C C C C
charge: 0.287613 0.008091 0.474047 0.435870 -0.119702 -0.119310 -0.138232 -0.137988 -0.222902 -0.103101 -0.364386
polarizability: 2.05186273e+02 7.33022657e-02 9.64337611e+01 1.10818067e+01 1.63753145e-02 7.10886698e+01
1716.lowfreq: -43.9844 -16.4846 -3.4916 -0.0016 -0.0009 0.0004 4.3236 31.4691 49.4491
frequency: -43.4893 28.3700 49.3516 57.2786 119.9182 169.8615 275.9954 312.3954 367.3555 385.2588 400.7970 405.2615 479.2906 488.2252 598.7596 636.8880 639.2200 725.5527 741.9878 822.8774 838.8541 848.6803 888.4889 958.1670 976.1302 987.7816 1012.5017 1047.0475 1099.5083 1137.6036 1193.0619 1223.1244 1226.2519 1235.2452 1314.1913 1378.5511 1396.7867 1409.8137 1455.3538 1469.7138 1472.6555 1508.1756 1582.8083 1622.7088 2085.3456 2978.3555 3056.3773 3060.5923 3089.8680 3119.4858 3120.8842 3139.9246 3141.6684 3146.5572
redmass: 1.0267 5.4521 6.5597 5.7649 8.4035 5.4507 2.3830 4.8538 2.4286 11.4469 8.6448 2.8461 4.7669 3.6145 6.2194 6.6456 8.1827 3.3375 3.1147 3.2417 1.9569 1.2522 1.4883 1.3331 1.3885 1.3931 2.9203 1.5803 1.1847 1.1470 1.1135 3.2260 1.7712 1.6020 1.2788 5.2961 1.2202 2.9436 1.1243 1.1019 1.0551 2.7274 6.0428 6.3559 12.7181 1.0387 1.0572 1.0948 1.1000 1.0875 1.0877 1.1010 1.1065 1.0979
irintensity: 0.6636 2.2962 0.1298 0.6424 6.3808 1.7308 1.8412 4.2909 0.0650 0.1638 2.4975 0.0126 23.8142 17.7847 36.9684 0.0076 9.4954 9.9178 5.8473 10.0504 33.9645 0.0004 0.9015 1.1760 0.0036 0.0931 3.1071 19.1547 4.4403 7.8044 10.2658 2.9580 2.2288 64.4467 0.3196 0.1202 12.8520 2.8877 5.4785 15.3493 13.2331 14.8105 0.0311 27.2124 42.7641 28.1648 8.3678 22.0726 16.5465 0.6203 22.1780 16.4064 20.5940 1.0448
temp: 298.150 k
press: 1.00000 atm
elementType: 16 7 6 6 6 6 6 6 6 6 6 1 1 1 1 1 1 1 1 1
symmnumber: 1
zpe: 400311.8 jmol-1
zpe.correction: 0.152471 hartree
zpe.thermalcorrener: 0.163016 hartree
zpe.thermalcorrenthalpy: 0.163960 hartree
zpe.thermalcorrgfe: 0.114265 hartree
zpe.sumelectzpe: -800.358013 hartree
zpe.sumelectthermal: -800.347468 hartree
zpe.sumelectthermalent: -800.346524 hartree
zpe.sumelectthermalfe: -800.396219 hartree
dipole: 6.0207 0.0081 -0.4559
dipole: 6.0380
quadrupole: -91.7560 -66.3235 -74.0167
quadrupole: -0.0472 1.4442 -0.0057
quadrupole: -14.3906 11.0419 3.3487 -0.0472 1.4442 -0.0057
hfenergy: -800.5104842 hartree
pointgroup: C01 [X(C9H9N1S1)]
dipole: -2.3630116 -0.0077605 0.2433089 debye
dipolederiv: -0.5447894 -0.0020689 0.0755408 -0.0009403 0.0304858 0.0013832 0.2107678 0.0020999 0.1482841 -0.5416473 -0.0024589 -0.0067506 -0.0018996 -0.2048858 0.000017 -0.1677662 -0.0011147 -0.2021333 -0.2038718 -0.0010421 -0.0115496 -0.0010403 -0.0444376 -0.0009518 -0.013058 -0.0011214 -0.1240408 0.4750912 0.0041748 0.1054701 0.0053004 -0.0048475 0.0008875 0.2018354 0.0014757 0.013664 0.0700825 0.0629404 0.0330159 -0.0754951 0.0633875 0.0177769 0.032127 0.0109032 -0.1225233 0.0697982 -0.0622867 0.0342648 0.0758939 0.0625613 -0.0204758 0.0303938 -0.0136332 -0.1219295 -0.2603198 -0.0966622 0.0087243 -0.2397413 0.0597773 -0.0281797 -0.0347245 -0.0268596 -0.1531009 -0.2646988 0.0925953 0.0067209 0.2346118 0.0651177 0.0245393 -0.0389833 0.0228077 -0.1540188 0.9083997 0.0021678 -0.2532843 -0.0002129 0.1314779 0.0004726 -0.5278147 -0.0008445 0.2915864 -0.1639396 -0.0021692 -0.0544432 -0.0039965 0.0764756 -0.0008847 -0.1991488 -0.001772 0.0253187 0.4255804 0.0034639 0.1107837 0.004107 -0.0382163 -0.0007495 0.3553738 0.0009638 -0.1704818 0.036398 -0.0966675 -0.0292041 -0.0898368 -0.0377751 -0.0135991 -0.0153591 -0.0194867 0.1356262 0.0339229 0.0970067 -0.0310637 0.0905272 -0.0345785 0.0161655 -0.0171905 0.0221577 0.1349678 0.0080052 0.0983665 -0.018911 0.1001818 -0.0504152 0.0168079 -0.026954 0.0158133 0.1470149 0.0107263 -0.097744 -0.0169989 -0.0998154 -0.0535795 -0.0135966 -0.0249925 -0.0127203 0.1474931 -0.0240699 -0.0138404 0.0265942 -0.0616829 -0.0078046 -0.0697879 0.0865958 -0.0468534 -0.0191103 -0.025343 0.0142418 0.0253238 0.0631008 -0.0044834 0.0697094 0.0849017 0.0473074 -0.0213321 -0.00011 -0.0381158 0.0123435 -0.1182954 -0.0615015 0.0807363 0.0729072 0.0737955 0.0789743 -0.0019905 0.0391515 0.0125561 0.1207304 -0.0625776 -0.0776635 0.0714126 -0.0700468 0.0820018 -0.0072243 -0.0010531 -0.0291329 -0.0014968 0.1158195 -0.0026072 -0.0803234 -0.0028714 -0.1162607 unknown
polarizability: 205.6840969|0.5810087|96.434982|7.4435148|-0.1795691|70.5896252 unknown
InChI: InChI=1S/C9H9NS/c1-8-2-4-9(5-3-8)6-11-7-10/h2-5H,6H2,1H3
charge 0 multiplicity 1
20 atoms
S  2.411213 0.008886 -0.981043
N  5.183215 0.024746 0.016063
C  -0.030905 0.008023 0.44232
C  -2.844964 -0.015756 -0.103855
C  -0.751238 1.221667 0.291726
C  -0.734745 -1.217683 0.312951
C  -2.136288 1.20745 0.026948
C  -2.119774 -1.226834 0.048178
C  1.442572 0.020212 0.729359
C  -4.329816 -0.028626 -0.421048
C  4.04633 0.020282 -0.37264
H  -0.224556 2.178887 0.387519
H  -0.195163 -2.165886 0.425099
H  -2.676947 2.155813 -0.077163
H  -2.647504 -2.184111 -0.039422
H  1.779177 0.93285 1.24208
H  1.790438 -0.877746 1.260168
H  -4.825879 -0.921919 -0.003301
H  -4.837514 0.866455 -0.021518
H  -4.497653 -0.040912 -1.515518
