program: Gaussian 09
title: 000186023
version: EM64L-G09RevD.01
frameworkgroup: C1[X(C18H14O2)]
method: RPBEPBE
basis: SDD
operation: Freq
keyword: #pfreq=noraman
keyword: PBEPBE/SDD
title: #p freq=noraman PBEPBE/SDD
converged: NO YES NO NO
title: Mulliken charges:
elementType: O O C C C C C C C C C C C C C C C C C C H H H H H H H H H H H H H H
charge: -0.279523 -0.275992 0.174691 0.433527 0.410183 -0.514921 -0.431968 -0.382114 -0.446002 -0.433925 -0.249548 -0.274282 -0.239186 0.224732 0.215036 -0.342346 -0.336390 -0.219342 -0.217263 -0.222095 0.233615 0.254207 0.234807 0.277341 0.239560 0.237168 0.229264 0.231606 0.229032 0.269363 0.273558 0.233249 0.231599 0.232358
chargesum: 0.00000
title: Mulliken charges with hydrogens summed into heavy atoms:
elementType: O O C C C C C C C C C C C C C C C C C C
charge: -0.279523 -0.275992 0.174691 0.433527 0.410183 -0.027098 -0.197161 -0.104772 -0.206442 -0.196757 -0.020284 -0.042676 -0.010154 0.224732 0.215036 -0.072984 -0.062832 0.013907 0.014336 0.010263
polarizability: 2.40522635e+02 -1.94574479e+01 2.18453120e+02 -9.97127894e+00 1.16990145e+01 1.43559628e+02
1716.lowfreq: -5.6449 -4.3295 -0.0008 -0.0007 0.0001 6.3807 17.0009 27.2747 40.2922
frequency: 16.9292 27.2509 40.1817 71.0380 108.5511 122.8896 165.7608 178.3494 201.9310 233.8695 268.4426 327.3470 369.9805 403.3975 421.4489 430.3899 440.6646 471.3813 483.0431 492.5777 508.7513 559.0066 598.1029 614.4644 653.8532 658.4635 677.9042 701.0451 705.3885 750.7959 774.4653 785.7254 794.2413 795.3319 819.2880 854.7979 865.1586 874.4910 894.1978 925.3573 956.0572 971.0369 977.0506 989.6320 990.3911 996.9285 1001.9088 1008.7831 1017.6025 1026.6083 1045.7403 1063.0717 1084.3458 1087.3838 1152.3604 1173.7679 1177.1285 1180.8945 1185.5250 1222.5189 1238.5567 1240.1611 1256.5202 1284.3521 1314.5584 1350.4383 1382.9014 1390.3862 1408.3951 1421.7032 1438.3892 1445.7857 1457.6519 1477.4133 1487.9030 1520.6312 1582.7729 1590.4156 1600.9750 1610.2242 1614.6106 1635.0288 3030.2928 3096.7932 3121.3486 3122.5106 3129.4250 3130.4242 3134.3961 3143.0156 3148.8075 3155.5865 3157.9115 3163.5771 3167.5233 3180.3340
redmass: 5.1618 5.3227 4.3599 7.6089 5.4066 5.4271 4.7648 4.1731 5.2034 6.4240 4.1409 3.6741 5.1321 2.8292 3.9355 3.0434 3.7328 3.3553 5.2413 5.2031 5.3442 4.8145 4.0799 6.4376 5.6385 4.1901 5.0754 1.6346 4.4680 1.3094 5.3450 3.4454 2.4053 2.1447 1.8299 3.4387 1.2445 5.1566 1.8517 1.4678 1.4195 1.3765 2.1044 1.4181 5.9480 1.3868 1.3285 1.3280 3.2982 2.7500 2.6315 2.7446 1.7708 1.8835 1.4137 1.0585 1.1576 1.1285 1.2009 1.2286 2.8166 1.9316 1.7689 1.7151 1.3192 1.4138 2.1217 10.1559 3.1627 5.1190 2.2520 2.3211 2.5381 2.2572 1.1424 3.5698 7.0123 7.4188 5.3125 6.8265 7.9275 6.4472 1.0574 1.1076 1.0864 1.0862 1.0916 1.0855 1.0887 1.0892 1.0948 1.0940 1.0991 1.1006 1.0982 1.0974
irintensity: 0.6022 0.1990 0.2975 2.8399 0.1432 0.9070 0.5351 2.1808 1.1636 7.2187 2.8696 11.5302 0.4730 0.0163 3.2593 2.7190 0.4928 1.1363 15.0795 6.8366 2.6146 3.1789 9.8440 0.7088 2.0166 4.2813 17.6773 84.2710 10.9469 1.4827 3.9469 19.3173 47.5183 29.1874 97.1768 28.3840 0.0404 40.4631 1.6383 0.6791 4.0778 1.6815 3.7631 3.6860 2.0370 0.0558 0.2090 0.3652 149.1355 5.8852 181.8084 26.4739 5.8208 17.2998 2.6889 0.7974 10.8913 48.0982 2.1337 7.2269 263.3281 65.3766 3.2053 0.7925 2.3765 29.4164 6.8644 3.0540 2.0745 0.0922 15.8491 1.8635 0.3617 8.8110 21.3398 14.7948 55.8024 0.9006 3.9993 26.5207 112.6145 0.2934 32.6434 10.3605 2.2270 1.0001 18.8943 0.2357 17.6295 11.0837 9.5421 16.1723 37.4645 28.2524 22.5334 8.0147
temp: 298.150 k
press: 1.00000 atm
elementType: 8 8 6 6 6 6 6 6 6 6 6 6 6 6 6 6 6 6 6 6 1 1 1 1 1 1 1 1 1 1 1 1 1 1
symmnumber: 1
zpe: 699975.2 jmol-1
zpe.correction: 0.266606 hartree
zpe.thermalcorrener: 0.282476 hartree
zpe.thermalcorrenthalpy: 0.283420 hartree
zpe.thermalcorrgfe: 0.220966 hartree
zpe.sumelectzpe: -843.409502 hartree
zpe.sumelectthermal: -843.393633 hartree
zpe.sumelectthermalent: -843.392688 hartree
zpe.sumelectthermalfe: -843.455142 hartree
dipole: -0.0341 -1.0483 -1.7851
dipole: 2.0704
quadrupole: -97.6861 -104.5875 -116.7775
quadrupole: -2.7080 1.2355 -1.3992
quadrupole: 8.6643 1.7629 -10.4271 -2.7080 1.2355 -1.3992
hfenergy: -843.6761087 hartree
pointgroup: C01 [X(C18H14O2)]
dipole: 0.0004836 -0.0159209 0.8144044 debye
polarizability: 238.7870724|16.6128773|192.874204|-13.9289719|-39.07908|170.8741075 unknown
InChI: InChI=1S/C18H14O2/c19-18(15-8-2-1-3-9-15)20-13-16-11-6-10-14-7-4-5-12-17(14)16/h1-12H,13H2
charge 0 multiplicity 1
34 atoms
O  0.877857 -1.212932 -0.113853
O  1.525171 -0.194902 -2.117538
C  -2.197749 -0.134506 -0.313151
C  -1.584863 -1.42415 -0.080617
C  -3.415612 0.197497 0.403066
C  -0.31788 -1.837427 -0.790634
C  -2.177426 -2.321509 0.81753
C  -1.656788 0.834702 -1.22497
C  -3.982375 -0.752524 1.316016
C  -4.037442 1.470953 0.182463
C  -3.376425 -1.992039 1.519637
C  -2.288651 2.065481 -1.420303
C  -3.487637 2.390515 -0.711829
C  2.873841 0.109635 -0.106756
C  1.724646 -0.422182 -0.895322
C  3.843254 0.892448 -0.786576
C  3.01352 -0.142944 1.282948
C  4.946089 1.416371 -0.081957
C  4.118142 0.385287 1.983522
C  5.085554 1.163725 1.304021
H  -0.151744 -2.922649 -0.694602
H  -0.289279 -1.548923 -1.855385
H  -1.707725 -3.297756 0.98817
H  -0.737723 0.612875 -1.777406
H  -4.902962 -0.488812 1.850479
H  -4.957354 1.709972 0.729671
H  -3.814273 -2.716215 2.214721
H  -1.861292 2.790271 -2.121816
H  -3.970055 3.360431 -0.875158
H  3.712418 1.074976 -1.858296
H  2.256418 -0.743342 1.794497
H  5.694295 2.019237 -0.607677
H  4.225836 0.19284 3.056443
H  5.942612 1.571994 1.851462
