program: Gaussian 09
title: 000186003
version: EM64L-G09RevD.01
frameworkgroup: C1[X(C7H5N)]
method: RPBEPBE
basis: SDD
operation: Freq
keyword: #p
keyword: freq=noraman
keyword: PBEPBE/SDD
title: #p freq=noraman PBEPBE/SDD
converged: NO YES NO NO
title: Mulliken charges:
elementType: N C C C C C C C H H H H H
charge: 0.000861 0.252212 -0.293243 -0.174027 -0.439783 -0.317870 0.135802 -0.453311 0.259904 0.235551 0.263270 0.246734 0.283900
chargesum: 0.00000
title: Mulliken charges with hydrogens summed into heavy atoms:
elementType: N C C C C C C C
charge: 0.000861 0.252212 -0.033339 0.061524 -0.176513 -0.071136 0.135802 -0.169410
polarizability: 1.33783295e+02 2.45454999e+00 7.07325282e+01 2.34938284e-03 9.71451195e-04 3.12882855e+01
1716.lowfreq: -13.3139 -7.9819 -0.0006 -0.0004 0.0007 9.6532 143.0937 144.2275 334.4184
frequency: 143.0860 144.2166 334.4179 399.6518 470.6344 504.6305 546.7114 614.1997 631.5597 656.1914 715.4397 769.3144 824.2875 923.6152 947.7355 992.3710 1000.0331 1025.7426 1112.2420 1193.3891 1220.1484 1299.4083 1331.6061 1397.8829 1455.0974 1536.1258 1578.9077 2132.0523 3137.2413 3142.0444 3152.2418 3174.3195 3424.5228
redmass: 3.8653 4.0923 3.4361 3.5099 7.2209 7.0083 5.0039 7.5793 1.2445 1.2312 1.9600 7.0534 1.6137 1.3722 1.4947 1.3847 3.8725 3.2810 1.6460 1.5752 2.0836 8.4728 1.3274 2.0729 2.0536 4.9442 5.8867 6.2519 1.0874 1.0931 1.0922 1.1006 1.1566
irintensity: 0.7769 1.4424 2.8321 1.2648 0.4514 5.2186 1.2251 0.9993 69.7297 69.0851 34.0189 0.1529 48.5542 2.2749 3.5685 0.3188 9.8746 0.3245 6.1354 3.0492 1.7827 0.0988 2.4569 18.8644 25.1137 6.9280 0.4716 1.5442 8.9114 8.2527 13.6626 18.8325 86.5188
temp: 298.150 k
press: 1.00000 atm
elementType: 7 6 6 6 6 6 6 6 1 1 1 1 1
symmnumber: 1
zpe: 250803.5 jmol-1
zpe.correction: 0.095526 hartree
zpe.thermalcorrener: 0.102010 hartree
zpe.thermalcorrenthalpy: 0.102954 hartree
zpe.thermalcorrgfe: 0.064966 hartree
zpe.sumelectzpe: -323.877077 hartree
zpe.sumelectthermal: -323.870593 hartree
zpe.sumelectthermalent: -323.869649 hartree
zpe.sumelectthermalfe: -323.907637 hartree
dipole: -0.7437 2.2790 0.0000
dipole: 2.3973
quadrupole: -37.8785 -45.5083 -49.2907
quadrupole: 5.4826 0.0003 0.0002
quadrupole: 6.3473 -1.2824 -5.0649 5.4826 0.0003 0.0002
hfenergy: -323.9726034 hartree
pointgroup: C01 [X(C7H5N1)]
dipole: -0.3114473 0.8902603 0.0000175 debye
dipolederiv: -0.3827823 -0.0249359 -0.0000029 -0.0122645 -0.3242607 -0.0000022 -0.0000042 -0.0000026 -0.2391913 0.3238875 0.0722433 0.0000062 -0.0455085 -0.1239995 -0.0000061 0.0000036 -0.0000031 0.0778401 0.025192 -0.0497239 0.0000025 -0.0254548 0.1341641 0.000006 0.0000036 0.0000057 -0.1225679 -0.1770044 0.0948046 0.0000002 0.2303919 0.0017827 0.0000075 0.0000034 0.0000044 -0.102572 0.0602983 -0.0070139 0.0000026 0.0934119 0.314792 0.0000113 0.0000054 0.0000068 -0.0688054 0.3116295 0.0449564 0.0000102 -0.1191982 0.1157187 0.0000013 0.0000041 0.0000058 -0.0779859 0.172007 -0.029531 0.0000037 0.0285255 -0.1051639 -0.0000017 0.0000068 -0.0000031 -0.0077998 -0.5857487 0.0074698 -0.0000069 -0.0104215 -0.2734167 0.0000008 -0.0000099 0.000001 -0.3127369 0.0597598 0.079646 0. 0.0616193 -0.0183641 -0.0000027 -0.0000007 -0.0000025 0.1509418 0.0248416 -0.0825469 -0.000005 -0.1112426 -0.0466035 -0.0000073 -0.0000058 -0.0000066 0.1627245 0.0359556 -0.0789903 -0.0000041 -0.0830375 -0.0197149 -0.0000054 -0.0000036 -0.0000038 0.1344875 -0.1199919 -0.0266481 -0.0000066 -0.002676 0.0878223 -0.0000013 -0.0000043 -0.0000019 0.1428338 0.2519558 0.0002697 0.0000002 -0.0041452 0.2572434 -0.0000002 0.0000016 0. 0.2628317 unknown
polarizability: 133.6516591|3.7824934|70.8641645|0.0023284|0.0010208|31.2882855 unknown
InChI: InChI=1S/C7H5N/c1-2-7-4-3-5-8-6-7/h1,3-6H
charge 0 multiplicity 1
13 atoms
N  1.563332 -1.225751 -0.00003
C  -0.551767 0.029524 -0.000049
C  0.173163 1.255452 -0.000004
C  1.581924 1.220289 0.000027
C  0.203643 -1.183058 -0.000063
C  2.234815 -0.034717 0.000015
C  -1.984855 -0.000109 -0.00008
C  -3.21936 -0.044549 -0.000105
H  -0.368991 2.206401 0.000007
H  2.166704 2.145239 0.000061
H  -0.31364 -2.148952 -0.000094
H  3.328224 -0.103023 0.000037
H  -4.293692 -0.082447 -0.000122
