program: Gaussian 09
title: 000185984
version: EM64L-G09RevD.01
frameworkgroup: C1[X(C8H16O)]
method: RPBEPBE
basis: SDD
operation: Freq
keyword: #pfreq=noraman
keyword: PBEPBE/SDD
title: #p freq=noraman PBEPBE/SDD
converged: YES YES NO NO
title: Mulliken charges:
elementType: O C C C C C C C C H H H H H H H H H H H H H H H H
charge: -0.428031 -0.357710 -0.339101 -0.378044 -0.355955 -0.466979 -0.694917 -0.133297 -0.207947 0.211248 0.177488 0.181527 0.185502 0.195424 0.194846 0.192273 0.196091 0.188446 0.205943 0.208661 0.214148 0.209880 0.234963 0.208999 0.356542
chargesum: 0.00000
title: Mulliken charges with hydrogens summed into heavy atoms:
elementType: O C C C C C C C C
charge: -0.071489 0.031026 0.027928 0.012225 0.032410 -0.072590 -0.062228 0.101666 0.001052
polarizability: 1.05368004e+02 -1.07096652e+01 9.31008192e+01 3.60470277e+00 -4.66076838e+00 7.73036180e+01
1716.lowfreq: -11.8179 -11.6987 -0.0004 -0.0004 0.0007 7.4848 36.6626 55.8281 68.6413
frequency: 36.5306 55.4463 68.5977 112.0222 120.6801 127.6722 168.3048 215.6217 229.2809 258.0274 306.8362 333.9973 404.4537 492.1528 510.9323 723.9330 745.8281 786.6836 827.6987 850.5614 886.9469 927.4380 928.2772 983.9681 996.4907 1027.3943 1070.4106 1075.7869 1097.8304 1109.2867 1120.4814 1171.1089 1196.1684 1202.9316 1250.1209 1261.5454 1282.6895 1284.2554 1293.7597 1306.9808 1318.3186 1346.4674 1349.1693 1356.8120 1388.9255 1458.5303 1462.4471 1464.7680 1471.5787 1476.7502 1481.3265 1488.6101 1706.1277 2950.2929 2950.7381 2956.1100 2963.9847 2968.4896 2971.3052 2989.6727 3002.1434 3011.9069 3022.2067 3040.1461 3067.7580 3070.2196 3089.0558 3114.2264 3618.0399
redmass: 4.3608 1.7065 2.1411 2.2303 3.1645 1.8011 1.9419 2.0191 1.1179 2.0573 2.0439 3.1099 3.0205 3.8248 2.4511 1.0726 1.1703 1.6147 1.3057 2.0472 1.8732 1.3383 1.1297 2.4275 1.5252 2.8016 2.8001 2.4346 3.1399 2.0888 1.4396 1.4638 1.3757 1.4447 1.2984 1.2662 1.0455 1.2282 1.1765 1.2977 1.3123 1.3629 1.5540 1.5851 1.2174 1.0930 1.0835 1.0670 1.0739 1.0425 1.0745 1.0897 5.4350 1.0595 1.0591 1.0617 1.0602 1.0595 1.0370 1.0955 1.0989 1.0997 1.1032 1.1039 1.1007 1.0993 1.0938 1.0899 1.0671
irintensity: 0.2088 0.0996 7.9667 14.7084 7.5494 0.0468 61.4326 28.5947 0.1527 42.6440 6.4952 1.1729 5.0960 8.1715 8.9550 12.7256 1.1675 0.7320 9.0419 1.6940 4.7407 10.8433 87.8131 10.8098 2.9052 1.0811 70.1644 0.6524 105.3223 20.5907 4.8812 32.5057 30.9769 1.2186 3.8149 0.7733 0.4873 11.6872 5.3676 2.2081 6.5012 0.8463 2.3874 2.9185 12.0696 14.3723 1.1549 0.0060 0.9082 12.1566 2.5347 19.7425 60.7228 15.2128 13.4443 15.5411 22.4162 133.9302 33.6232 3.7974 12.2897 35.4710 2.4152 116.9601 96.0778 53.8765 27.2428 21.2404 39.2121
temp: 298.150 k
press: 1.00000 atm
elementType: 8 6 6 6 6 6 6 6 6 1 1 1 1 1 1 1 1 1 1 1 1 1 1 1 1
symmnumber: 1
zpe: 582612.8 jmol-1
zpe.correction: 0.221906 hartree
zpe.thermalcorrener: 0.234015 hartree
zpe.thermalcorrenthalpy: 0.234959 hartree
zpe.thermalcorrgfe: 0.182634 hartree
zpe.sumelectzpe: -388.890182 hartree
zpe.sumelectthermal: -388.878073 hartree
zpe.sumelectthermalent: -388.877128 hartree
zpe.sumelectthermalfe: -388.929454 hartree
dipole: 0.1094 -0.3512 1.9096
dipole: 1.9447
quadrupole: -58.8453 -54.7093 -56.0480
quadrupole: -4.1582 7.3817 -3.7054
quadrupole: -2.3111 1.8249 0.4862 -4.1582 7.3817 -3.7054
hfenergy: -389.1120873 hartree
pointgroup: C01 [X(C8H16O1)]
dipole: 0.0434839 0.1379787 -0.7513181 debye
dipolederiv: -0.8081025 -0.4265829 -0.0438165 -0.5304604 -1.009358 -0.0843426 -0.3503259 -0.4551956 -0.164525 -0.0537918 0.0346892 0.0224824 0.0529189 0.0311682 0.0325283 0.0212803 0.0562686 0.1493984 -0.0015955 0.0562805 0.0232555 0.0951391 0.094834 0.0422314 -0.0035611 0.042633 0.1594769 0.0414142 0.0530155 0.0117984 -0.0139066 0.1073572 0.0265977 -0.0048201 -0.0408646 0.1628981 0.0205785 0.0308768 0.0180721 -0.0032776 0.107906 0.0293957 0.0434153 0.0246197 0.1537208 0.0842209 0.0025955 0.0097323 0.0210181 0.1399151 -0.0412458 0.0314024 0.0497614 0.1299392 -0.0739707 0.0232624 0.0322217 0.0602546 0.0669395 0.0052189 0.012551 0.0113452 0.0844284 -0.3347557 0.0034326 0.0214802 0.0554012 -0.2384058 0.0035121 0.2161397 0.1592051 0.0241564 0.3136949 0.6546345 0.0219593 0.7503468 0.7775856 -0.0048091 0.2164455 0.2523146 0.2163898 0.0486129 -0.060348 -0.0238621 -0.0922324 -0.1206756 -0.0448964 -0.0258501 -0.0626955 0.0353594 0.0355923 0.0109724 0.0182888 0.0048305 0.0475794 0.0230531 0.0189688 0.0331518 -0.1971794 -0.0146264 -0.0798562 -0.029568 -0.093463 -0.1416525 -0.0574674 -0.0418199 -0.0806927 0.035587 0.0423962 0.0134631 0.004337 0.0073869 0.0489719 0.0226398 0.0266589 0.042801 -0.1974404 -0.0570445 -0.137171 -0.0292079 -0.0876315 -0.150163 -0.0517809 -0.0485653 -0.086311 0.0408368 0.0444432 0.019184 0.0110206 0.0326818 0.0605877 0.0012692 0.0183827 0.0508252 -0.1903946 0.0327153 0.0082623 0.0422262 0.0169797 0.0580774 0.0094744 0.0221822 0.0473826 -0.2051238 -0.0226929 -0.1080867 -0.0358656 -0.0755299 -0.126577 -0.0551078 -0.0416102 -0.0815387 0.0437639 0.0366984 -0.0265009 0.0065913 -0.0460784 0.0625048 0.0591738 0.0141265 -0.0296505 -0.18724 -0.0549346 0.0699056 -0.0151909 0.0653998 -0.1953551 0.0316506 -0.0583228 0.031093 0.0772352 0.0151526 -0.0725353 -0.0204983 -0.142003 -0.0954429 -0.0818911 -0.0411906 -0.0896658 0.0470406 -0.0652703 0.1226628 -0.027569 0.1630897 -0.0883645 0.0621152 -0.0468478 0.071089 0.0712824 0.064499 -0.0025682 -0.007984 -0.0200766 0.0927665 0.0230657 0.0598692 0.009051 -0.1880807 0.1643364 -0.0530938 -0.0036159 -0.0777571 0.0850542 -0.0061237 -0.046985 -0.0320737 -0.0963982 0.1557594 -0.0913636 -0.0434229 -0.0993519 0.0665318 -0.023534 -0.0422082 -0.0221141 -0.1442916 0.3866706 -0.0451307 0.0371354 -0.0436786 0.3182151 0.0792727 0.0506844 0.0992612 0.1391603 unknown
polarizability: 105.3708133|10.7123447|93.1000023|-3.5904992|-4.658498|77.3016251 unknown
InChI: InChI=1S/C8H16O/c1-2-3-4-5-6-7-8-9/h7-9H,2-6H2,1H3
charge 0 multiplicity 1
25 atoms
O  3.700812 1.656814 0.308228
C  -0.746977 -0.299615 -0.276376
C  -2.224677 -0.364637 0.170913
C  0.079483 -1.520388 0.183186
C  -3.056619 0.856118 -0.284904
C  1.567528 -1.474884 -0.267769
C  -4.532883 0.780977 0.162015
C  2.357537 -0.349369 0.36823
C  2.972562 0.630662 -0.33639
H  -0.280068 0.625794 0.11617
H  -0.70218 -0.225295 -1.384002
H  -2.690414 -1.292065 -0.22469
H  -2.269723 -0.443652 1.277632
H  -0.384924 -2.447793 -0.211306
H  0.038841 -1.595862 1.2897
H  -3.007635 0.937677 -1.390195
H  -2.593514 1.781131 0.115275
H  1.611305 -1.388192 -1.372786
H  2.040418 -2.445569 -0.009382
H  -5.025477 -0.119991 -0.250398
H  -5.105791 1.664242 -0.175838
H  -4.610631 0.728935 1.264592
H  2.429996 -0.330177 1.464481
H  2.929701 0.667485 -1.436007
H  4.084728 2.284353 -0.349479
